{"text_format":"1","workbook":"xlsx","n_sheets":5,"sheets":["Pravidla","Výsledky","Knt","Seřazení Knt","Žebříček"],"not_rendered":{"charts":0,"images":0,"macros":1,"external_links":0,"defined_names":1,"comments":0,"pivot_tables":1},"unopened":[],"bounds":{"document_bytes":16777216,"sheet_cells":100000,"rows_first":2000,"rows_last":500,"rows_between":2000,"halvings":0,"cell_chars":16384,"cell_head_chars":4096},"cells_cut":0,"cells_raw":0,"read":"whole","date_system":"1900"}

{"sheet":"Pravidla","index":0,"n_rows":4,"n_cols":1,"rows_kept":4,"cut":false,"hidden":false,"merged":[]}
["O pořadí v žebříčku rozhoduje  :"]
["1. - počet bodů (1. m. = 3 b., 2. m. = 2 b., 3. m. = 1 b. + 1. za každý vyhraný zápas)"]
["2. - rozdíl vyhraných a prohraných zápasů"]
["3. - podíl vyhraných a prohraných zápasů"]

{"sheet":"Výsledky","index":1,"n_rows":500,"n_cols":13,"rows_kept":500,"cut":false,"hidden":false,"merged":[]}
["datum","příjmení","jméno","rok nar.","hm. kateg.","umístění","výhry","remíza","prohry","pom. b. +","pom. b. -","příjmení a jméno","body"]
["2016-02-06","Vojkovský","Dalibor",2005,48,2,3,0,1,30,10,{"$f":"B2&\" \"&C2","v":"Vojkovský Dalibor"},{"$f":"IF(ISBLANK(F2),\"\",IF(F2<4,CHOOSE(F2,3,2,1),0)+G2)","v":5}]
["2016-02-06","Čapek","Dominik",2004,48,3,1,1,2,5,20,{"$f":"B3&\" \"&C3","v":"Čapek Dominik"},{"$f":"IF(ISBLANK(F3),\"\",IF(F3<4,CHOOSE(F3,3,2,1),0)+G3)","v":2}]
["2016-02-06","Doležal","Martin",2005,48,5,0,1,3,0,25,"Doležal Martin",0]
["2016-02-06","Neckář","Matěj",2005,48,1,4,0,0,40,0,"Neckář Matěj",7]
["2016-02-06","Pravda ","Adam",2006,48,4,0,2,2,0,20,"Pravda  Adam",0]
["2016-02-06","Mec","Tobias",2007,24,3,2,1,1,20,7,"Mec Tobias",3]
["2016-02-06","Doubek","Benjamin",2006,24,1,3,1,0,30,0,"Doubek Benjamin",6]
["2016-02-06","Verbík","Vojtěch",2007,24,5,0,0,4,0,37,"Verbík Vojtěch",0]
["2016-02-06","Buřil","Marek",2007,24,4,1,0,3,7,30,"Buřil Marek",1]
["2016-02-06","Salzman","Václav",2007,24,2,3,0,1,27,10,"Salzman Václav",5]
["2016-02-06","Káňová","Barbora",2009,23,2,2,0,1,20,10,"Káňová Barbora",4]
["2016-02-06","Peter","Matyáš",2010,23,4,0,0,3,0,30,"Peter Matyáš",0]
["2016-02-06","Gal","Richard",2008,23,1,3,0,0,30,0,"Gal Richard",6]
["2016-02-06","Graňák","Dominik",2008,23,"4.",1,0,2,10,20,"Graňák Dominik",1]
["2016-02-06","Trelova","Klára Annu",2008,31,4,0,0,3,0,30,"Trelova Klára Annu",0]
["2016-02-06","Šotolu","Kryštof",2007,31,3,1,0,2,10,20,"Šotolu Kryštof",2]
["2016-02-06","Ďuriš","Vojtěch",2007,31,1,3,0,0,30,0,"Ďuriš Vojtěch",6]
["2016-02-06","Hranický","Václav",2008,31,2,2,0,1,20,10,"Hranický Václav",4]
["2016-02-06","Kožušník","Václav",2009,28,3,0,2,1,0,5,"Kožušník Václav",1]
["2016-02-06","Stark","Vojtěch",2009,28,2,1,1,1,10,10,"Stark Vojtěch",3]
["2016-02-06","Filipiak","Adam",2009,28,4,0,2,1,0,10,"Filipiak Adam",0]
["2016-02-06","Mička","Tomáš",2008,28,1,2,1,0,15,0,"Mička Tomáš",5]
["2016-02-06","Mohyla","David",2009,20,2,2,0,1,20,10,"Mohyla David",4]
["2016-02-06","Molkovčák","Matěj",2009,20,4,0,0,3,0,30,"Molkovčák Matěj",0]
["2016-02-06","Nováček","Nicolas",2009,20,1,3,0,0,30,0,"Nováček Nicolas",6]
["2016-02-06","Revťáková","Magdaléna",2009,20,3,1,0,2,10,20,"Revťáková Magdaléna",2]
["2016-02-06","Pavlík","Adam",2006,37,4,1,0,3,10,30,"Pavlík Adam",1]
["2016-02-06","Buček","Dan",2007,37,5,1,0,3,10,30,"Buček Dan",1]
["2016-02-06","Štěpnička","Matyáš",2006,37,3,2,1,1,20,10,"Štěpnička Matyáš",3]
["2016-02-06","Rapčanová","Alice",2006,37,2,2,1,1,20,10,"Rapčanová Alice",4]
["2016-02-06","Kožušník","Vojtěch",2006,37,1,2,2,0,20,0,"Kožušník Vojtěch",5]
["2016-02-06","Marný","Jakub",2003,60,1,2,0,0,20,0,"Marný Jakub",5]
["2016-02-06","Knop","Jakub",2006,60,2,1,0,1,10,10,"Knop Jakub",3]
["2016-02-06","Zakaryan","Erik",2006,60,3,0,0,2,0,20,"Zakaryan Erik",1]
["2016-02-06","Rybář","Adam",2007,33,3,1,0,2,7,20,"Rybář Adam",2]
["2016-02-06","Bača","Nicolas",2007,33,2,2,0,1,20,10,"Bača Nicolas",4]
["2016-02-06","Michalczyková","Anna",2008,33,4,0,0,3,0,27,"Michalczyková Anna",0]
["2016-02-06","Pospíšil","Jan",2007,33,1,3,0,0,30,0,"Pospíšil Jan",6]
["2016-02-06","Bonczek","Jakub",2005,30,4,0,1,2,0,20,"Bonczek Jakub",0]
["2016-02-06","Beutel","David",2005,30,1,3,0,0,25,0,"Beutel David",6]
["2016-02-06","Žmuda","Julia",2005,30,2,2,0,1,15,10,"Žmuda Julia",4]
["2016-02-06","Buranyč","Filip",2005,30,3,0,1,2,0,10,{"$f":"B43&\" \"&C43","v":"Buranyč Filip"},{"$f":"IF(ISBLANK(F43),\"\",IF(F43<4,CHOOSE(F43,3,2,1),0)+G43)","v":1}]
["2016-02-06","Čechová","Klára",2005,30,4,0,1,2,0,20,"Čechová Klára",0]
["2016-02-06","Suchan","Jan",2006,30,2,2,0,1,15,10,"Suchan Jan",4]
["2016-02-06","Rapčanová","Silvie",2006,30,1,3,0,0,30,0,"Rapčanová Silvie",6]
["2016-02-06","Caletka","Michal",2005,30,3,0,1,2,0,15,"Caletka Michal",1]
["2016-02-06","Pabjan","Tomáš",2004,36,2,2,1,1,20,10,"Pabjan Tomáš",4]
["2016-02-06","Siekiera","Jakub",2004,36,1,4,0,0,40,0,"Siekiera Jakub",7]
["2016-02-06","Kobeljáková","Barbora",2004,36,5,0,1,3,0,30,"Kobeljáková Barbora",0]
["2016-02-06","Válek","Prokop",2005,36,4,1,0,3,10,30,"Válek Prokop",1]
["2016-02-06","Zach","Jan",2005,36,3,2,0,2,20,20,"Zach Jan",3]
["2016-02-06","Kobeljáková","Carolína",2006,34,4,0,0,3,0,30,"Kobeljáková Carolína",0]
["2016-02-06","Hisem","Matěj",2004,34,3,1,0,2,10,15,"Hisem Matěj",2]
["2016-02-06","Žmuda","Maja",2005,34,1,3,0,0,25,0,"Žmuda Maja",6]
["2016-02-06","Končítek","Kryštof",2006,34,2,2,0,1,20,10,"Končítek Kryštof",4]
["2016-02-06","Brož","Ondřej",2005,39,3,1,0,2,10,15,"Brož Ondřej",2]
["2016-02-06","Čech","Jiří",2005,39,2,2,0,1,20,10,"Čech Jiří",4]
["2016-02-06","Novotný","Kryštof",2005,39,1,3,0,0,25,0,"Novotný Kryštof",6]
["2016-02-06","Večeřa","Adam",2008,39,4,0,0,3,0,30,"Večeřa Adam",0]
["2016-02-06","Valentík","Tomáš",2005,33,3,1,0,2,10,20,"Valentík Tomáš",2]
["2016-02-06","Kolář","Vojtěch",2006,33,1,3,0,0,30,0,"Kolář Vojtěch",6]
["2016-02-06","Jakšík","Daniel",2005,33,2,2,0,1,20,10,"Jakšík Daniel",4]
["2016-02-06","Fajkus","Adrian",2005,33,4,0,0,3,0,30,"Fajkus Adrian",0]
["2016-02-06","To","Adam",2007,27,2,3,0,1,25,10,"To Adam",5]
["2016-02-06","Beikel","Lukáš",2007,27,5,0,0,4,0,40,"Beikel Lukáš",0]
["2016-02-06","Havelka","Josef",2006,27,4,1,0,3,10,25,"Havelka Josef",1]
["2016-02-06","Grym","Petr",2006,27,3,2,0,2,20,17,"Grym Petr",3]
["2016-02-06","Neuwirt","Petr",2006,27,1,4,0,0,37,0,"Neuwirt Petr",7]
["2016-02-06","Boráňová","Lenka",2007,28,4,1,0,3,7,30,"Boráňová Lenka",1]
["2016-02-06","Muráň","Tomáš",2007,28,2,3,0,1,30,10,"Muráň Tomáš",5]
["2016-02-06","Leone","Luca",2007,28,1,4,0,0,40,0,"Leone Luca",7]
["2016-02-06","Schotli","Josef",2007,28,3,2,0,2,20,20,"Schotli Josef",3]
["2016-02-06","Štaffa","Ondřej",2005,28,5,0,0,4,0,37,"Štaffa Ondřej",0]
["2016-02-06","Twirda","Daniela",2005,41,3,0,0,2,0,20,"Twirda Daniela",1]
["2016-02-06","Náplava","Richard",2005,41,1,2,0,0,20,0,"Náplava Richard",5]
["2016-02-06","Benáčková","Denisa",2004,41,2,1,0,1,10,10,"Benáčková Denisa",3]
["2016-02-06","Caletka","Petr",2005,38,3,0,1,1,0,10,"Caletka Petr",1]
["2016-02-06","Kobiernicki","Marek",2006,38,2,0,2,0,0,0,"Kobiernicki Marek",2]
["2016-02-06","Pindor","Miroslav",2004,38,1,1,1,0,10,0,"Pindor Miroslav",4]
["2016-02-06","Nenička","František",2010,20,3,0,0,2,0,20,"Nenička František",1]
["2016-02-06","Brezoňák","Jakub",2008,20,2,1,0,1,10,10,"Brezoňák Jakub",3]
["2016-02-06","Halagačka","Jiří",2008,20,1,2,0,0,20,0,"Halagačka Jiří",5]
["2016-02-06","Lysický","Sebastián",2008,25,3,1,0,2,10,15,"Lysický Sebastián",2]
["2016-02-06","Večeřa","Jiří",2006,25,4,0,0,3,0,30,"Večeřa Jiří",0]
["2016-02-06","Glac","Adam",2009,25,2,2,0,1,20,10,"Glac Adam",4]
["2016-02-06","Ryška","Filip",2008,25,1,3,0,0,25,0,"Ryška Filip",6]
["2016-03-05","Halagačka","Jiří",2008,23,2,2,0,1,20,10,"Halagačka Jiří",4]
["2016-03-05","Káňová","Barbora",2009,23,3,1,0,2,10,20,"Káňová Barbora",2]
["2016-03-05","Nováček","Nikolas",2009,23,1,3,0,0,30,0,"Nováček Nikolas",6]
["2016-03-05","Petr","Matyáš",2010,23,4,0,0,3,0,30,"Petr Matyáš",0]
["2016-03-05","Vránová","Eva",2009,23,3,1,0,2,7,20,"Vránová Eva",2]
["2016-03-05","Kocmanová","Lucie",2008,23,2,2,0,1,20,7,"Kocmanová Lucie",4]
["2016-03-05","Brada","Tomáš",2008,23,1,3,0,0,27,0,"Brada Tomáš",6]
["2016-03-05","Graňák","Dominik",2008,23,4,0,0,3,0,27,"Graňák Dominik",0]
["2016-03-05","Neuwirt","Petr",2006,25,1,3,0,0,25,0,"Neuwirt Petr",6]
["2016-03-05","Doubek","Benjamin",2006,25,3,1,0,2,10,20,"Doubek Benjamin",2]
["2016-03-05","Kubíková","Rosalie",2006,25,4,0,0,3,0,30,"Kubíková Rosalie",0]
["2016-03-05","Gil","Mikolaj",2006,25,2,2,0,1,20,10,"Gil Mikolaj",4]
["2016-03-05","Lysický","Sebastián",2008,26,3,1,0,2,10,20,"Lysický Sebastián",2]
["2016-03-05","Huvar","Matyáš",2009,26,1,3,0,0,25,0,"Huvar Matyáš",6]
["2016-03-05","Vjaclovský","David",2008,26,"4.",0,0,3,0,30,"Vjaclovský David",0]
["2016-03-05","Ryška","Filip",2008,26,2,2,0,1,20,5,"Ryška Filip",4]
["2016-03-05","Nuhlíček","Jakub",2007,26,4,0,0,3,0,30,"Nuhlíček Jakub",0]
["2016-03-05","Sněhota","Matyáš",2007,26,2,2,0,1,20,7,"Sněhota Matyáš",4]
["2016-03-05","Kolářová","Valentýna",2007,26,3,1,0,2,10,20,"Kolářová Valentýna",2]
["2016-03-05","Vrbas","Alexandr",2007,26,1,3,0,0,27,0,{"$f":"B107&\" \"&C107","v":"Vrbas Alexandr"},{"$f":"IF(ISBLANK(F107),\"\",IF(F107<4,CHOOSE(F107,3,2,1),0)+G107)","v":6}]
["2016-03-05","Michálek","Jaub",2009,27,4,0,0,3,0,20,"Michálek Jaub",0]
["2016-03-05","Kolář","Václav",2007,27,2,2,0,1,20,10,"Kolář Václav",4]
["2016-03-05","Stark","Vojtěch",2009,27,3,1,0,2,5,20,"Stark Vojtěch",2]
["2016-03-05","Mička","Tomáš",2008,27,1,3,0,0,25,0,"Mička Tomáš",6]
["2016-03-05","Papavasilevský","Marek",2007,27,1,3,0,0,30,0,"Papavasilevský Marek",6]
["2016-03-05","Dvorský","Denis",2007,27,2,2,0,1,17,10,"Dvorský Denis",4]
["2016-03-05","Havelka","Josef",2006,27,3,1,0,2,1,17,"Havelka Josef",2]
["2016-03-05","To","Adam",2007,27,4,0,0,3,0,21,"To Adam",0]
["2016-03-05","Grym","Petr",2006,29,2,1,1,0,5,0,"Grym Petr",3]
["2016-03-05","Sedláček","Vojtěch",2006,29,1,1,1,0,10,0,"Sedláček Vojtěch",4]
["2016-03-05","Havelka","Štěpán",2006,29,3,0,0,2,0,15,"Havelka Štěpán",1]
["2016-03-05","Muraň","Tomáš",2004,31,2,2,0,2,20,20,"Muraň Tomáš",4]
["2016-03-05","Linhartová","Alexandra",2005,31,4,1,0,3,10,25,"Linhartová Alexandra",1]
["2016-03-05","Válek","Matěj",2006,31,5,1,0,3,7,27,"Válek Matěj",1]
["2016-03-05","Suchan","Matěj",2006,31,3,2,0,2,15,17,"Suchan Matěj",3]
["2016-03-05","Jakšík","Daniel",2005,31,1,4,0,0,37,0,"Jakšík Daniel",7]
["2016-03-05","Urban","Matěj",2008,32,1,3,0,0,30,0,"Urban Matěj",6]
["2016-03-05","Jurček","Vojtěch",2008,32,"4.",0,0,3,0,30,"Jurček Vojtěch",0]
["2016-03-05","Římánek","Petr",2008,32,3,1,0,2,10,20,"Římánek Petr",2]
["2016-03-05","Šotola","Kryštof",2007,32,2,2,0,1,20,10,"Šotola Kryštof",4]
["2016-03-05","Kolář","Vojtěch",2006,33,3,2,0,2,17,15,"Kolář Vojtěch",3]
["2016-03-05","Rabčanová","Sylvie",2006,33,5,0,1,3,0,30,"Rabčanová Sylvie",0]
["2016-03-05","Končítek","Kryštof",2006,33,1,4,0,0,30,0,"Končítek Kryštof",7]
["2016-03-05","Bonczek","Jakub",2005,33,4,0,1,3,0,27,"Bonczek Jakub",0]
["2016-03-05","Salek","Natalia",2005,33,2,3,0,1,30,5,"Salek Natalia",5]
["2016-03-05","Valentík","Tomáš",2005,35,1,3,1,0,31,0,"Valentík Tomáš",6]
["2016-03-05","Pospíšil","Jan",2007,35,3,2,1,1,21,10,"Pospíšil Jan",3]
["2016-03-05","Bukovjanová","Charlote",2007,35,5,0,0,4,0,40,"Bukovjanová Charlote",0]
["2016-03-05","Matušek","Jakub",2006,35,4,1,0,3,10,30,"Matušek Jakub",1]
["2016-03-05","Řeha","Daniel",2006,35,2,2,2,0,22,0,"Řeha Daniel",4]
["2016-03-05","Rapčanová","Alice",2006,37,1,2,0,0,20,0,"Rapčanová Alice",5]
["2016-03-05","Salamonová","Karolína",2007,37,3,0,0,2,0,20,"Salamonová Karolína",1]
["2016-03-05","Tarkovský","Tomáš",2006,37,2,1,0,1,10,10,"Tarkovský Tomáš",3]
["2016-03-05","Válek","Prokop",2005,37,3,1,1,2,11,20,"Válek Prokop",2]
["2016-03-05","Hisem","Matěj",2004,37,1,4,0,0,37,0,"Hisem Matěj",7]
["2016-03-05","Rodryčová","Adéla",2005,37,4,1,0,3,10,27,"Rodryčová Adéla",1]
["2016-03-05","Siekera","Jakub",2004,37,2,2,1,1,20,10,"Siekera Jakub",4]
["2016-03-05","Pindor","Mirek",2004,37,5,1,0,3,10,30,"Pindor Mirek",1]
["2016-03-05","Sedláček","Jakub",2004,42,1,4,0,0,32,0,"Sedláček Jakub",7]
["2016-03-05","Děrgelová","Adéla",2004,42,3,1,1,2,11,20,"Děrgelová Adéla",2]
["2016-03-05","Benáčková","Denisa",2004,42,5,0,1,3,1,25,"Benáčková Denisa",0]
["2016-03-05","Čech","Jiří",2005,42,2,3,0,1,27,10,"Čech Jiří",5]
["2016-03-05","Bencúr","Eliáš",2003,42,4,1,0,3,10,24,"Bencúr Eliáš",1]
["2016-03-05","Křenek","Jakub",2006,46,2,3,0,1,30,10,"Křenek Jakub",5]
["2016-03-05","Novotný","Kryštof",2005,46,3,2,1,1,18,10,"Novotný Kryštof",3]
["2016-03-05","Dvořák","Adam",2006,46,5,0,0,4,0,40,"Dvořák Adam",0]
["2016-03-05","Koběrský","Marek",2006,46,4,1,0,3,10,27,"Koběrský Marek",1]
["2016-03-05","Vavřina","Viktor",2006,46,1,3,1,0,31,0,"Vavřina Viktor",6]
["2016-03-05","Neckář","Matěj",2005,52,2,3,0,1,25,10,"Neckář Matěj",5]
["2016-03-05","Kopecký","Patrik",2008,52,4,1,0,3,10,30,"Kopecký Patrik",1]
["2016-03-05","Náplava","Richard",2005,52,3,2,0,2,20,6,"Náplava Richard",3]
["2016-03-05","Choleva","Martin",2003,52,1,4,0,0,31,0,"Choleva Martin",7]
["2016-03-05","Homola","Martin",2008,52,5,0,0,4,0,40,"Homola Martin",0]
["2016-04-16","Havelka","Josef",null,28,2,2,1,1,18,11,"Havelka Josef",4]
["2016-04-16","Nuhlíček","Jakub",null,28,3,2,0,2,20,17,"Nuhlíček Jakub",3]
["2016-04-16","Mička","Tomáš",null,28,4,1,0,3,10,27,"Mička Tomáš",1]
["2016-04-16","Stark","Vojtěch",null,28,4,1,1,2,8,16,"Stark Vojtěch",1]
["2016-04-16","To","Adam",null,28,1,3,0,1,25,10,"To Adam",6]
["2016-04-16","Nováček","Nikolas",null,25,3,3,0,1,12,12,"Nováček Nikolas",4]
["2016-04-16","Nuhlíček","Michal",null,25,4,2,0,2,11,16,"Nuhlíček Michal",2]
["2016-04-16","Vlaškovský","Lukáš",null,25,2,3,0,1,16,11,"Vlaškovský Lukáš",5]
["2016-04-16","Kolářová","Valentýna",null,25,1,4,0,0,40,0,"Kolářová Valentýna",7]
["2016-04-16","Titz","Boris",null,25,5,0,0,4,0,40,"Titz Boris",0]
["2016-04-16","Vojkovský","Dalibor",null,55,2,1,0,1,10,10,{"$f":"B171&\" \"&C171","v":"Vojkovský Dalibor"},{"$f":"IF(ISBLANK(F171),\"\",IF(F171<4,CHOOSE(F171,3,2,1),0)+G171)","v":3}]
["2016-04-16","Smolka","František",null,55,3,0,0,2,0,20,"Smolka František",1]
["2016-04-16","Strachota","Vojtěch",null,55,1,2,0,0,20,0,"Strachota Vojtěch",5]
["2016-04-16","Pindor","Miroslav",null,38,3,1,1,2,11,21,"Pindor Miroslav",2]
["2016-04-16","Valentík","Tomáš",null,38,4,1,0,3,10,27,"Valentík Tomáš",1]
["2016-04-16","Bencúr","Eliáš",null,38,2,2,1,1,13,6,"Bencúr Eliáš",4]
["2016-04-16","Líbenek","Štěpán",null,38,1,4,0,0,35,0,"Líbenek Štěpán",7]
["2016-04-16","Válek","Prokop",null,38,5,1,0,3,10,25,"Válek Prokop",1]
["2016-04-16","Křenek","Jakub",null,41,1,3,0,0,30,0,"Křenek Jakub",6]
["2016-04-16","Dvořák","Adam",null,41,3,1,0,2,7,15,"Dvořák Adam",2]
["2016-04-16","Brož","Ondřej",null,41,2,2,0,1,15,10,"Brož Ondřej",4]
["2016-04-16","Twirdá","Daniela",null,41,4,0,0,3,0,27,"Twirdá Daniela",0]
["2016-04-16","Krischke","Fabian",null,36,3,1,0,2,10,17,"Krischke Fabian",2]
["2016-04-16","Řeha","Daniel",null,36,1,3,0,0,24,0,"Řeha Daniel",6]
["2016-04-16","Novák","Matyáš",null,36,4,0,0,3,0,30,"Novák Matyáš",0]
["2016-04-16","Rapčanová","Alice",null,36,2,2,0,1,20,7,"Rapčanová Alice",4]
["2016-04-16","Havelka","Štěpán",null,27,3,2,1,1,21,6,"Havelka Štěpán",3]
["2016-04-16","Rojíček","Jan",null,27,1,3,1,0,20,1,"Rojíček Jan",6]
["2016-04-16","Doubek","Benjamin",null,27,2,2,2,0,17,2,"Doubek Benjamin",4]
["2016-04-16","Kolář","Václav",null,27,"4.",1,0,3,10,27,"Kolář Václav",1]
["2016-04-16","Ryška","Filip",null,27,5,0,0,4,0,32,"Ryška Filip",0]
["2016-04-16","Lysický","Sebastián",null,26,2,2,0,1,10,10,"Lysický Sebastián",4]
["2016-04-16","Dvorský","Denis",null,26,1,3,0,0,21,0,"Dvorský Denis",6]
["2016-04-16","Mecnerová","Adéla",null,26,3,1,0,2,1,21,"Mecnerová Adéla",2]
["2016-04-16","Graňák","Dominik",null,26,3,1,0,2,1,9,"Graňák Dominik",2]
["2016-04-16","Wi","Alex",null,31,1,3,1,0,28,1,"Wi Alex",6]
["2016-04-16","Suchan","Jan",null,31,2,3,0,1,30,10,"Suchan Jan",5]
["2016-04-16","Turek","Jakub",null,31,4,0,1,3,1,28,"Turek Jakub",0]
["2016-04-16","Papavasilevský","Marek",null,31,4,0,1,3,1,31,"Papavasilevský Marek",0]
["2016-04-16","Rapčanová","Silvie",null,31,3,2,1,1,21,11,"Rapčanová Silvie",3]
["2016-04-16","Šimkovič","Ondřej",null,36,4,0,0,3,0,30,"Šimkovič Ondřej",0]
["2016-04-16","Pospíšil","Jan",null,36,2,2,0,1,15,10,"Pospíšil Jan",4]
["2016-04-16","Baudiš","Michal",null,36,3,1,0,2,10,15,"Baudiš Michal",2]
["2016-04-16","Salamonová","Karolína",null,36,1,3,0,0,30,0,"Salamonová Karolína",6]
["2016-04-16","Benáčková","Denisa",null,45,3,0,0,2,0,20,"Benáčková Denisa",1]
["2016-04-16","Macháček","Matyáš",null,45,2,1,0,1,10,5,"Macháček Matyáš",3]
["2016-04-16","Náplava","Richard",null,45,1,2,0,0,15,0,"Náplava Richard",5]
["2016-04-16","Vlček ","Lukáš",null,40,4,0,1,2,1,21,"Vlček  Lukáš",0]
["2016-04-16","Přikryl","Tomáš",null,40,1,2,1,0,21,1,"Přikryl Tomáš",5]
["2016-04-16","Buček","Dan",null,40,3,1,0,2,10,20,"Buček Dan",2]
["2016-04-16","Skácel","Antonín",null,40,2,2,0,1,20,10,"Skácel Antonín",4]
["2016-04-16","Schotli","Josef",null,33,2,2,0,1,20,10,"Schotli Josef",4]
["2016-04-16","Mikenda","Ondřej",null,33,3,0,1,2,1,21,"Mikenda Ondřej",1]
["2016-04-16","Šotola","Kryštof",null,33,3,0,1,2,1,21,"Šotola Kryštof",1]
["2016-04-16","Bukovjanová","Charlotte",null,33,1,3,0,0,30,0,"Bukovjanová Charlotte",6]
["2016-05-21","Marný","Jakub",null,65,1,2,0,0,20,0,"Marný Jakub",5]
["2016-05-21","Prášek","Filip",null,65,2,0,0,2,0,20,"Prášek Filip",2]
["2016-05-21","Vojkovský","Dalibor",null,50,2,2,0,1,20,0,"Vojkovský Dalibor",4]
["2016-05-21","Náplava","Richard",null,50,1,3,0,0,30,0,"Náplava Richard",6]
["2016-05-21","Čapek","Dominik",null,50,3,0,1,2,1,0,"Čapek Dominik",1]
["2016-05-21","Holík","Denis",null,50,3,0,1,2,1,0,"Holík Denis",1]
["2016-05-21","Caletka","Petr",null,42,3,1,0,2,10,20,"Caletka Petr",2]
["2016-05-21","Benáčková","Denisa",null,42,2,1,1,0,11,0,"Benáčková Denisa",3]
["2016-05-21","Bencúr","Eliáš",null,42,1,3,0,0,27,0,"Bencúr Eliáš",6]
["2016-05-21","Ponča","Tomáš",null,42,4,0,1,2,0,1,"Ponča Tomáš",0]
["2016-05-21","Rapčanová","Sylvie",null,34,1,2,1,0,21,0,"Rapčanová Sylvie",5]
["2016-05-21","Suchan","Jan",null,34,2,1,1,1,11,0,"Suchan Jan",3]
["2016-05-21","Wi","Alex",null,34,3,0,2,1,2,0,"Wi Alex",1]
["2016-05-21","Dinaj","Tomáš",null,34,3,1,0,2,7,0,"Dinaj Tomáš",2]
["2016-05-21","Caletka","Michal",null,31,3,1,0,2,10,20,"Caletka Michal",2]
["2016-05-21","Hladík","Václav",null,31,4,0,0,3,0,30,"Hladík Václav",0]
["2016-05-21","Černý","Michal",null,31,1,3,0,0,30,0,"Černý Michal",6]
["2016-05-21","Válek","Matěj",null,31,2,2,0,1,20,10,"Válek Matěj",4]
["2016-05-21","Buček","Dan",null,37,5,0,1,3,1,30,"Buček Dan",0]
["2016-05-21","Fajkus","Adrian",null,37,3,2,0,2,20,20,{"$f":"B235&\" \"&C235","v":"Fajkus Adrian"},{"$f":"IF(ISBLANK(F235),\"\",IF(F235<4,CHOOSE(F235,3,2,1),0)+G235)","v":3}]
["2016-05-21","Rapčanová","Alice",null,37,2,3,0,1,27,0,"Rapčanová Alice",5]
["2016-05-21","Jahodová","Petra",null,37,4,0,2,0,2,0,"Jahodová Petra",0]
["2016-05-21","Salamonová","Karolína",null,37,1,3,1,0,31,0,"Salamonová Karolína",6]
["2016-05-21","Bukovjanová","Charlotte",null,32,1,3,0,0,30,0,"Bukovjanová Charlotte",6]
["2016-05-21","Schotli","Josef",null,32,2,1,0,2,10,20,"Schotli Josef",3]
["2016-05-21","Šotola","Kryštof",null,32,2,1,0,2,10,20,"Šotola Kryštof",3]
["2016-05-21","Mikenda","Ondřej",null,32,2,1,0,2,10,20,"Mikenda Ondřej",3]
["2016-05-21","To","Adam",null,27,1,2,1,0,16,0,"To Adam",5]
["2016-05-21","Nuhlíček","Jakub",null,27,3,1,0,2,5,20,"Nuhlíček Jakub",2]
["2016-05-21","Vrbas","Alexander",null,27,4,1,0,2,10,20,"Vrbas Alexander",1]
["2016-05-21","Huvar","Matyáš",null,27,2,1,1,1,6,0,"Huvar Matyáš",3]
["2016-05-21","Lysický","Sebastián",null,28,1,2,0,0,12,0,"Lysický Sebastián",5]
["2016-05-21","Mička","Tomáš",null,28,2,1,0,1,10,10,"Mička Tomáš",3]
["2016-05-21","Stark","Vojtěch",null,28,3,0,0,2,0,20,"Stark Vojtěch",1]
["2016-05-21","Muráň","Tomáš",null,32,4,1,0,3,0,30,"Muráň Tomáš",1]
["2016-05-21","Turek","Jakub",null,32,1,4,0,0,37,0,"Turek Jakub",7]
["2016-05-21","Volná","Valerie",null,32,3,2,0,2,17,20,"Volná Valerie",3]
["2016-05-21","Remo","Dominik",null,32,2,2,0,2,20,20,"Remo Dominik",4]
["2016-05-21","Římánek","Petr",null,32,4,1,0,3,10,30,"Římánek Petr",1]
["2016-05-21","Nováček","Nicolas",null,23,2,1,0,1,10,10,"Nováček Nicolas",3]
["2016-05-21","Fránek","Daniel",null,23,3,0,0,2,0,20,"Fránek Daniel",1]
["2016-05-21","Graňák","Dominik",null,23,1,2,0,0,15,0,"Graňák Dominik",5]
["2016-05-21","Kocmanová","Lucie",null,26,1,2,1,0,16,0,"Kocmanová Lucie",5]
["2016-05-21","Vlaškovský","Lukáš",null,26,4,0,1,2,1,20,"Vlaškovský Lukáš",0]
["2016-05-21","Michálek","Jakub",null,26,3,0,2,0,2,0,"Michálek Jakub",1]
["2016-05-21","Ryška","Filip",null,26,2,2,0,1,20,0,"Ryška Filip",4]
["2016-09-23","Zakaryan","Erik",null,57,3,1,0,2,10,20,"Zakaryan Erik",2]
["2016-09-23","Hodák","Daniel",null,57,4,0,0,3,0,30,"Hodák Daniel",0]
["2016-09-23","Vojkovský","Dalibor",null,57,2,2,0,1,20,10,"Vojkovský Dalibor",4]
["2016-09-23","Náplava","Richard",null,57,1,4,0,0,30,0,"Náplava Richard",7]
["2016-09-23","Weiser","Mikuláš",null,48,2,0,0,2,0,20,"Weiser Mikuláš",2]
["2016-09-23","Wilkus","Richard",null,43,3,0,0,2,0,15,"Wilkus Richard",1]
["2016-09-23","Vavřina","Viktor",null,43,1,2,0,0,20,0,"Vavřina Viktor",5]
["2016-09-23","Rapčanová","Alice",null,43,2,1,0,1,5,10,"Rapčanová Alice",3]
["2016-09-23","Pospíšil","Jan",null,38,2,1,2,0,12,0,"Pospíšil Jan",3]
["2016-09-23","Buček","Dan",null,38,4,0,1,2,1,20,"Buček Dan",0]
["2016-09-23","Jahodová","Petra",null,38,3,1,0,2,5,20,"Jahodová Petra",2]
["2016-09-23","Hegner","Leoš",null,38,1,2,1,0,21,0,"Hegner Leoš",5]
["2016-09-23","Matějíčka","Štěpán",null,36,2,1,0,1,10,10,"Matějíčka Štěpán",3]
["2016-09-23","Nováková","Emma",null,36,3,0,0,2,0,20,"Nováková Emma",1]
["2016-09-23","Kristýna","Kazsperová",null,36,1,2,0,0,20,0,"Kristýna Kazsperová",5]
["2016-09-23","Stark","Vojtěch",null,30,4,1,0,3,7,25,"Stark Vojtěch",1]
["2016-09-23","Vrbas","Alexander",null,30,2,3,0,1,25,10,"Vrbas Alexander",5]
["2016-09-23","Večeřa","Jiří",null,30,5,0,0,4,0,37,"Večeřa Jiří",0]
["2016-09-23","To","Adam",null,30,1,4,0,0,40,0,"To Adam",7]
["2016-09-23","Marvan","Lukáš",null,30,3,2,0,2,15,0,"Marvan Lukáš",3]
["2016-09-23","Graňák","Dominik",null,25,1,3,0,1,22,10,"Graňák Dominik",6]
["2016-09-23","Nováček","Nicolas",null,25,2,2,1,1,21,10,"Nováček Nicolas",4]
["2016-09-23","Martinásek","Šimon",null,25,5,0,0,4,0,29,"Martinásek Šimon",0]
["2016-09-23","Fojtík","Jiří",null,25,4,2,0,2,27,15,"Fojtík Jiří",2]
["2016-09-23","Černá","Veronika",null,25,3,2,1,0,16,11,"Černá Veronika",3]
["2016-09-23","Peter","Matyáš",null,26,4,0,0,3,0,30,"Peter Matyáš",0]
["2016-09-23","Urban","Filip",null,26,3,1,0,2,10,20,"Urban Filip",2]
["2016-09-23","Michálek","Jakub",null,26,2,20,0,1,20,10,"Michálek Jakub",22]
["2016-09-23","Lysický","Sebastián",null,26,1,3,0,0,30,0,"Lysický Sebastián",6]
["2016-09-23","Matušek","Jakub",null,32,2,2,0,1,20,7,"Matušek Jakub",4]
["2016-09-23","Suchan","Jan",null,32,1,3,0,0,22,0,"Suchan Jan",6]
["2016-09-23","Hladík","Václav",null,32,3,1,0,2,10,15,"Hladík Václav",2]
["2016-09-23","Míčka","Tomáš",null,32,4,0,0,3,0,30,"Míčka Tomáš",0]
["2016-09-23","Mikenda","Ondřej",null,34,3,0,1,2,1,17,"Mikenda Ondřej",1]
["2016-09-23","Bukovjanová","Charlotte",null,34,4,0,1,2,1,20,"Bukovjanová Charlotte",0]
["2016-09-23","Rapčanová","Sylvie",null,34,1,3,0,0,30,0,"Rapčanová Sylvie",6]
["2016-09-23","Šotola","Kryštof",null,34,2,2,0,1,17,10,"Šotola Kryštof",4]
["2016-09-23","Papavasilevský","Marek",null,34,1,4,0,0,35,0,{"$f":"B299&\" \"&C299","v":"Papavasilevský Marek"},{"$f":"IF(ISBLANK(F299),\"\",IF(F299<4,CHOOSE(F299,3,2,1),0)+G299)","v":7}]
["2016-09-23","Turek","Jakub",null,34,2,3,0,1,27,5,"Turek Jakub",5]
["2016-09-23","Remo","Dominik",null,34,5,0,0,4,0,35,"Remo Dominik",0]
["2016-09-23","Leone","Luca",null,34,3,2,0,2,15,20,"Leone Luca",3]
["2016-09-23","Kožušník","Václav",null,34,4,1,0,3,10,27,"Kožušník Václav",1]
["2016-10-22","Slowik","Nikolas",null,24,"4.",1,0,2,7,17,"Slowik Nikolas",1]
["2016-10-22","Kubík","Lukáš",null,24,3,1,1,2,7,10,"Kubík Lukáš",2]
["2016-10-22","Wojtas","Ines",null,24,2,1,0,2,10,17,"Wojtas Ines",3]
["2016-10-22","Kristen","Vilém",null,24,1,2,1,0,20,0,"Kristen Vilém",5]
["2016-10-22","Suchánek","Aleš",null,38,4,0,0,3,0,30,"Suchánek Aleš",0]
["2016-10-22","Matějíčka","Štěpán",null,38,1,2,1,0,20,0,"Matějíčka Štěpán",5]
["2016-10-22","Románek","Jakub",null,38,2,2,0,1,17,10,"Románek Jakub",4]
["2016-10-22","Nováková","Emma",null,38,3,1,1,1,10,7,"Nováková Emma",2]
["2016-10-22","Kulhánek","Adam",null,36,2,2,0,1,15,10,"Kulhánek Adam",4]
["2016-10-22","Šotola","Kryštof",null,36,3,1,0,2,10,20,"Šotola Kryštof",2]
["2016-10-22","Ďuriš","Vojtěch",null,36,1,3,0,0,30,0,"Ďuriš Vojtěch",6]
["2016-10-22","Mikenda","Ondřej",null,36,4,0,0,3,0,30,"Mikenda Ondřej",0]
["2016-10-22","Mohyla","David",null,22,3,1,0,1,7,10,"Mohyla David",2]
["2016-10-22","Káňová","Barbora",null,22,2,1,0,1,10,7,"Káňová Barbora",3]
["2016-10-22","Nováček","Nikolas",null,22,1,2,0,0,20,0,"Nováček Nikolas",5]
["2016-10-22","Fojtík","Jiří",null,26,4,1,0,3,10,30,"Fojtík Jiří",1]
["2016-10-22","Graňák","Dominik",null,26,5,1,0,3,10,30,"Graňák Dominik",1]
["2016-10-22","Martinásek","Šimon",null,26,3,2,0,2,20,24,"Martinásek Šimon",3]
["2016-10-22","Kapias","Oliver",null,26,1,4,0,0,32,0,"Kapias Oliver",7]
["2016-10-22","Vjaclovský","David",null,26,2,3,0,1,27,5,"Vjaclovský David",5]
["2016-10-22","Starý","Patrik",null,29,4,1,0,3,10,30,"Starý Patrik",1]
["2016-10-22","Ryška","Filip",null,29,3,2,1,1,17,20,"Ryška Filip",3]
["2016-10-22","Marvan","Lukáš",null,29,2,2,0,2,20,14,"Marvan Lukáš",4]
["2016-10-22","To","Adam",null,29,1,4,0,0,37,0,"To Adam",7]
["2016-10-22","Jakšík","Petr",null,29,4,1,0,3,10,20,"Jakšík Petr",1]
["2016-10-22","Bůček","Dan",null,41,4,0,0,3,0,30,"Bůček Dan",0]
["2016-10-22","King","Samuel",null,41,2,2,0,1,20,10,"King Samuel",4]
["2016-10-22","Schwarz","Šimon",null,41,1,3,0,0,27,0,"Schwarz Šimon",6]
["2016-10-22","Baudiš","Michal",null,41,3,1,1,2,10,17,"Baudiš Michal",2]
["2016-10-22","Novotný","Kryštof",null,43,1,3,0,0,30,0,"Novotný Kryštof",6]
["2016-10-22","Sikora","Tomáš",null,43,4,0,0,3,0,30,"Sikora Tomáš",0]
["2016-10-22","Wilkus","Richard",null,43,3,1,0,2,10,20,"Wilkus Richard",2]
["2016-10-22","Čech","Jiří",null,43,2,2,0,1,20,10,"Čech Jiří",4]
["2016-10-22","Caletka","Michal",null,39,2,1,0,1,7,10,"Caletka Michal",3]
["2016-10-22","Šimkovič","Ondřej",null,39,3,0,0,2,0,17,"Šimkovič Ondřej",1]
["2016-10-22","Valentík","Tomáš",null,39,1,2,0,0,20,0,"Valentík Tomáš",5]
["2016-10-22","Stark","Vojtěch",null,25,2,2,0,1,20,15,"Stark Vojtěch",4]
["2016-10-22","Nekoranec","Vojtěch",null,25,3,0,0,3,0,30,"Nekoranec Vojtěch",1]
["2016-10-22","Filipiak","Adam",null,25,1,3,0,0,25,0,"Filipiak Adam",6]
["2016-10-22","Nuhlíček","Jakub",null,25,1,3,0,0,25,0,"Nuhlíček Jakub",6]
["2016-10-22","Boháč","Adam",null,46,1,3,0,1,30,10,"Boháč Adam",6]
["2016-10-22","Dvořák","Josef",null,46,"4.",1,1,2,10,20,"Dvořák Josef",1]
["2016-10-22","Smyček","Martin",null,46,4,0,1,2,0,30,"Smyček Martin",0]
["2016-10-22","Caletka","Petr",null,46,2,3,0,1,25,10,"Caletka Petr",5]
["2016-10-22","Benáčková","Denisa",null,46,3,1,2,1,10,5,"Benáčková Denisa",2]
["2016-10-22","Hladík","Václav",null,33,2,1,0,1,5,10,"Hladík Václav",3]
["2016-10-22","Bukovjanová","Charlotte",null,33,3,0,0,2,0,15,"Bukovjanová Charlotte",1]
["2016-10-22","Jakšík","Daniel",null,33,1,2,0,0,20,0,"Jakšík Daniel",5]
["2016-10-22","Görčoš","Václav",null,55,3,1,0,2,10,20,"Görčoš Václav",2]
["2016-10-22","Náplava","Richard",null,55,2,2,0,1,20,10,"Náplava Richard",4]
["2016-10-22","Vojkovský","Dalibor",null,55,1,3,0,0,30,0,"Vojkovský Dalibor",6]
["2016-10-22","Hodák","Daniel",null,55,4,0,0,3,0,30,"Hodák Daniel",0]
["2016-10-22","Vavřinová","Pavla",null,47,1,2,1,0,20,0,"Vavřinová Pavla",5]
["2016-10-22","Brož","Ondřej",null,47,1,2,0,1,20,10,"Brož Ondřej",5]
["2016-10-22","Morcinek","Lukáš",null,47,3,0,0,3,0,30,"Morcinek Lukáš",1]
["2016-10-22","Weiser","Mikuláš",null,47,2,1,0,2,10,10,"Weiser Mikuláš",3]
["2016-10-22","Pindor","Štěpán",null,24,4,0,0,3,0,27,"Pindor Štěpán",0]
["2016-10-22","Mec","Tobias",null,24,1,3,0,0,30,0,"Mec Tobias",6]
["2016-10-22","Kopcová","Eliška",null,24,3,1,0,2,7,20,"Kopcová Eliška",2]
["2016-10-22","Nuhlíček","Michal",null,24,2,2,0,1,20,10,{"$f":"B363&\" \"&C363","v":"Nuhlíček Michal"},{"$f":"IF(ISBLANK(F363),\"\",IF(F363<4,CHOOSE(F363,3,2,1),0)+G363)","v":4}]
["2016-11-19","Lysický","Sebastián",null,28,1,3,0,0,30,0,"Lysický Sebastián",6]
["2016-11-19","Vjaclovský","David",null,28,2,2,0,1,20,10,"Vjaclovský David",4]
["2016-11-19","Adamus","Jiří",null,28,3,1,0,2,10,20,"Adamus Jiří",2]
["2016-11-19","Stebnická","Lucie",null,28,4,0,0,3,0,30,"Stebnická Lucie",0]
["2016-11-19","Huvar","Matyáš",null,31,1,3,0,0,30,0,"Huvar Matyáš",6]
["2016-11-19","Míčka","Tomáš",null,31,2,2,0,1,20,10,"Míčka Tomáš",4]
["2016-11-19","Nekoranec","Vojtěch",null,31,3,1,0,2,10,20,"Nekoranec Vojtěch",2]
["2016-11-19","Dastych","Filip",null,31,4,0,0,3,0,30,"Dastych Filip",0]
["2016-11-19","Rapčanová","Silvie",null,31,1,3,0,0,27,0,"Rapčanová Silvie",6]
["2016-11-19","Turek","Jakub",null,31,2,2,0,1,14,0,"Turek Jakub",4]
["2016-11-19","Leone","Luca",null,31,3,1,0,2,10,0,"Leone Luca",2]
["2016-11-19","Moraň","Tomáš",null,31,4,0,0,3,0,27,"Moraň Tomáš",0]
["2016-11-19","Nováček","Nikolas",null,null,1,3,0,0,30,0,"Nováček Nikolas",6]
["2016-11-19","Žurek","Sebastián",null,null,2,2,0,1,20,10,"Žurek Sebastián",4]
["2016-11-19","Němec","Patrik",null,null,3,1,0,2,7,20,"Němec Patrik",2]
["2016-11-19","Kotouček","Marek",null,null,4,0,0,3,0,27,"Kotouček Marek",0]
["2016-11-19","Tomek","Vojtěch",null,null,1,3,0,0,30,0,"Tomek Vojtěch",6]
["2016-11-19","Valentík","Tomáš",null,null,2,2,0,1,20,10,"Valentík Tomáš",4]
["2016-11-19","Holaň","Erik",null,null,3,1,0,2,10,20,"Holaň Erik",2]
["2016-11-19","Caletka","Michal",null,null,4,0,0,3,0,30,"Caletka Michal",0]
["2016-11-19","Kožušník","Václav",null,null,1,3,0,0,27,10,"Kožušník Václav",6]
["2016-11-19","Stark","Vojtěch",null,null,2,2,0,1,17,10,"Stark Vojtěch",4]
["2016-11-19","Filipiak","Adam",null,null,3,1,0,2,10,17,"Filipiak Adam",2]
["2016-11-19","Kubala","Marek",null,null,4,0,0,3,0,30,"Kubala Marek",0]
["2016-11-19","Kajfosz","Kryštof",null,30,"1.",4,0,0,40,0,"Kajfosz Kryštof",4]
["2016-11-19","To","Adam",null,30,"2.",3,0,1,27,10,"To Adam",3]
["2016-11-19","Nuhlíček","Jakub",null,30,"3.",2,0,2,20,20,"Nuhlíček Jakub",2]
["2016-11-19","Bláhová","Alexandra",null,30,4,0,1,3,0,30,"Bláhová Alexandra",0]
["2016-11-19","Starý","Patrik",null,30,"4.",0,1,3,0,30,"Starý Patrik",0]
["2016-11-19","Mikendová","Tereza",null,52,1,2,0,0,20,0,"Mikendová Tereza",5]
["2016-11-19","Vojkovský","Dalibor",null,52,2,1,0,1,10,10,"Vojkovský Dalibor",3]
["2016-11-19","Grigarčíková","Barbora",null,52,3,0,0,2,0,20,"Grigarčíková Barbora",1]
["2016-11-19","Nuhlíček","Michal",null,29,1,4,0,0,40,0,"Nuhlíček Michal",7]
["2016-11-19","Wojtas","Ines",null,29,2,2,0,2,27,20,"Wojtas Ines",4]
["2016-11-19","Adamus","Jan",null,29,3,2,0,2,27,20,"Adamus Jan",3]
["2016-11-19","Ciora","Jakub",null,29,4,1,0,3,10,24,"Ciora Jakub",1]
["2016-11-19","Kopcová","Eliška",null,29,"5.",1,0,3,10,30,"Kopcová Eliška",1]
["2016-11-19","Marný","Jakub",null,null,1,1,0,0,10,0,"Marný Jakub",4]
["2016-11-19","Neumannová","Karolína",null,null,2,0,0,1,0,10,"Neumannová Karolína",2]
["2016-11-19","King","Samuel",null,null,1,2,0,0,20,10,"King Samuel",5]
["2016-11-19","Válek","Prokop",null,null,2,1,0,1,10,10,"Válek Prokop",3]
["2016-11-19","Buček","Dan",null,null,3,0,0,2,0,20,"Buček Dan",1]
["2016-11-19","Boháč","Adam",null,47,1,4,0,0,40,0,"Boháč Adam",7]
["2016-11-19","Vavřinová","Pavla",null,47,2,3,0,1,30,10,"Vavřinová Pavla",5]
["2016-11-19","Benáčková","Denisa",null,47,3,1,1,2,10,20,"Benáčková Denisa",2]
["2016-11-19","Pavlík","Lukáš",null,47,4,1,1,2,5,20,"Pavlík Lukáš",1]
["2016-11-19","Smyček","Patrik",null,47,5,0,0,4,0,40,"Smyček Patrik",0]
["2016-11-19","Caletka","Petr",null,44,1,4,0,0,37,0,"Caletka Petr",7]
["2016-11-19","Wilkus","Richard",null,44,2,3,0,1,30,10,"Wilkus Richard",5]
["2016-11-19","Záruba","Pavel",null,44,3,1,0,3,10,30,"Záruba Pavel",2]
["2016-11-19","Ponča","Tomáš",null,44,4,1,0,3,10,30,"Ponča Tomáš",1]
["2016-11-19","Morcinek","Lukáš",null,44,5,1,0,3,7,30,"Morcinek Lukáš",1]
["2016-11-19","Kocmanová","Lucie",null,25,1,4,0,0,40,0,"Kocmanová Lucie",7]
["2016-11-19","Martinásek","Šimon",null,25,2,3,0,1,30,10,"Martinásek Šimon",5]
["2016-11-19","Kapias","Oliver",null,25,3,2,0,2,20,20,"Kapias Oliver",3]
["2016-11-19","Kristen","Vilém",null,25,4,1,0,3,10,30,"Kristen Vilém",1]
["2016-11-19","Kusin","Oliver",null,25,5,0,0,4,0,40,"Kusin Oliver",0]
["2016-11-19","Šebesta","Jakub",null,36,1,2,0,1,20,10,"Šebesta Jakub",5]
["2016-11-19","Pospíšil","Jan",null,36,2,2,0,1,17,10,"Pospíšil Jan",4]
["2016-11-19","Šotola","Kryštof",null,36,3,1,0,20,10,20,"Šotola Kryštof",2]
["2016-11-19","Nováková","Emma",null,36,4,0,0,3,0,27,"Nováková Emma",0]
["2016-11-19","Mikenda","Ondřej",null,34,1,3,0,0,30,0,"Mikenda Ondřej",6]
["2016-11-19","Schotli","Josef",null,34,2,2,0,1,17,10,"Schotli Josef",4]
["2016-11-19","Bukovjanová","Charlotte",null,34,3,1,0,2,10,20,{"$f":"B427&\" \"&C427","v":"Bukovjanová Charlotte"},{"$f":"IF(ISBLANK(F427),\"\",IF(F427<4,CHOOSE(F427,3,2,1),0)+G427)","v":2}]
["2016-11-19","Římánek","Petr",null,34,4,0,0,3,0,27,"Římánek Petr",0]
["2016-11-19","Krischke","Fabian",null,40,1,2,0,0,20,10,"Krischke Fabian",5]
["2016-11-19","Rapčanová","Alice",null,40,2,1,0,1,10,10,"Rapčanová Alice",3]
["2016-11-19","Janková","Karolína",null,40,3,0,0,2,0,20,"Janková Karolína",1]
["2016-11-19","Kaszperová","Kristýna",null,40,1,2,0,0,20,0,"Kaszperová Kristýna",5]
["2016-11-19","Románek","Jakub",null,40,2,1,0,1,7,10,"Románek Jakub",3]
["2016-11-19","Vlk","František",null,40,3,0,0,2,0,17,"Vlk František",1]
["2016-11-19","Marvan","Lukáš",null,27,1,3,0,0,25,0,"Marvan Lukáš",6]
["2016-11-19","Lukas","Daniel",null,27,2,2,0,1,20,10,"Lukas Daniel",4]
["2016-11-19","Černá","Veronika",null,27,3,1,0,2,10,25,"Černá Veronika",2]
["2016-11-19","Peter","Matyáš",null,27,4,0,0,3,0,30,"Peter Matyáš",0]
["2016-12-10","Balada","Petr",null,null,3,0,0,2,0,20,"Balada Petr",1]
["2016-12-10","Valentík","Tomáš",null,null,1,2,0,0,20,0,"Valentík Tomáš",5]
["2016-12-10","Holaň","Erik",null,null,2,1,0,1,10,10,"Holaň Erik",3]
["2016-12-10","Rapčanová","Sylvie",null,null,2,1,0,1,10,7,"Rapčanová Sylvie",3]
["2016-12-10","Černý","Michal",null,null,1,2,0,0,17,0,"Černý Michal",5]
["2016-12-10","Suchan","Jan",null,null,3,0,0,2,0,20,"Suchan Jan",1]
["2016-12-10","Kaszperová","Kristýna",null,null,1,3,0,0,25,0,"Kaszperová Kristýna",6]
["2016-12-10","Krischke","Fabian",null,null,2,2,0,1,15,10,"Krischke Fabian",4]
["2016-12-10","Rapčanová","Alice",null,null,3,1,0,2,10,20,"Rapčanová Alice",2]
["2016-12-10","Buček","Dan",null,null,4,0,0,3,0,30,"Buček Dan",0]
["2016-12-10","Šnapka","Marek",null,null,4,1,0,2,7,20,"Šnapka Marek",1]
["2016-12-10","Čáp","Tommy",null,null,2,1,0,2,10,20,"Čáp Tommy",3]
["2016-12-10","Krischke","Simon",null,null,1,3,0,0,30,10,"Krischke Simon",6]
["2016-12-10","Dastych","Filip",null,null,3,1,0,2,10,20,"Dastych Filip",2]
["2016-12-10","Kotouček","Marek",null,null,3,0,0,2,0,17,"Kotouček Marek",1]
["2016-12-10","Žurek","Sebastián",null,null,1,2,0,0,20,0,"Žurek Sebastián",5]
["2016-12-10","Pitrman","Daniel",null,null,2,1,0,1,7,10,"Pitrman Daniel",3]
["2016-12-10","Boháč","Adam",null,null,2,4,0,1,40,10,"Boháč Adam",6]
["2016-12-10","Doležal","Martin",null,null,5,0,1,4,0,37,"Doležal Martin",0]
["2016-12-10","Pavlík","Lukáš",null,null,5,0,1,4,0,30,"Pavlík Lukáš",0]
["2016-12-10","Náplava","Richard",null,null,3,3,0,2,25,20,"Náplava Richard",4]
["2016-12-10","Vojkovský","Dalibor",null,null,1,5,0,0,50,0,"Vojkovský Dalibor",8]
["2016-12-10","Zakaryan","Erik",null,null,4,1,0,4,7,25,"Zakaryan Erik",1]
["2016-12-10","Kubala","Marek",null,null,2,1,1,2,10,20,"Kubala Marek",3]
["2016-12-10","Stark","Vojtěch",null,null,2,1,1,2,10,20,"Stark Vojtěch",3]
["2016-12-10","Filipiak","Adam",null,null,2,1,1,2,10,20,"Filipiak Adam",3]
["2016-12-10","Rošicová","Eliška",null,null,5,0,0,4,0,40,"Rošicová Eliška",0]
["2016-12-10","Kožušník","Václav",null,null,1,4,0,0,30,0,"Kožušník Václav",7]
["2016-12-10","Bukovjanová","Charlotte",null,null,1,2,0,1,20,10,"Bukovjanová Charlotte",5]
["2016-12-10","Kulhánek","Adam",null,null,1,2,0,1,20,10,"Kulhánek Adam",5]
["2016-12-10","Pospíšil","Jan",null,null,1,2,0,1,20,10,"Pospíšil Jan",5]
["2016-12-10","Gelnar","Lukáš",null,null,2,0,0,3,0,30,"Gelnar Lukáš",2]
["2016-12-10","Koch","Martin",null,null,4,1,0,4,10,40,"Koch Martin",1]
["2016-12-10","Kristen","Vilém",null,null,4,1,0,4,10,25,"Kristen Vilém",1]
["2016-12-10","Ciora","Jakub",null,null,3,2,0,2,20,17,"Ciora Jakub",3]
["2016-12-10","Nuhlíček","Michal",null,null,1,4,0,0,29,0,"Nuhlíček Michal",7]
["2016-12-10","Martinásek","Šimon",null,null,2,3,0,1,30,10,"Martinásek Šimon",5]
["2016-12-10","King","Samuel",null,null,4,0,0,3,0,30,"King Samuel",0]
["2016-12-10","Brož","Ondřej",null,null,2,2,0,1,20,10,"Brož Ondřej",4]
["2016-12-10","Čech","Jiří",null,null,1,2,1,0,21,0,"Čech Jiří",5]
["2016-12-10","Závodný","Matyáš",null,null,3,1,1,1,11,11,"Závodný Matyáš",2]
["2016-12-10","Smyček","Martin",null,null,2,1,0,2,10,20,"Smyček Martin",3]
["2016-12-10","Benáčková","Denisa",null,null,1,2,0,0,20,0,"Benáčková Denisa",5]
["2016-12-10","Marcinek","Lukáš",null,null,3,0,0,2,0,20,"Marcinek Lukáš",1]
["2016-12-10","Černá","Veronika",null,null,3,1,0,3,10,30,"Černá Veronika",2]
["2016-12-10","Kolář ","Václav",null,null,2,2,1,1,21,11,"Kolář  Václav",4]
["2016-12-10","Starý","Patrik",null,null,4,0,0,4,0,40,"Starý Patrik",0]
["2016-12-10","Nuhlíček","Jakub",null,null,1,4,0,0,40,0,"Nuhlíček Jakub",7]
["2016-12-10","Sněhota","Matyáš",null,null,2,2,1,1,21,11,"Sněhota Matyáš",4]
["2016-12-10","Švejnoh","Maxmilián",null,null,3,1,0,2,5,20,"Švejnoh Maxmilián",2]
["2016-12-10","Šotola","Kryštof",null,null,2,2,0,1,15,10,"Šotola Kryštof",4]
["2016-12-10","Ďuriš","Vojtěch",null,null,1,2,1,0,21,0,"Ďuriš Vojtěch",5]
["2016-12-10","Lysický","Sebastián",null,null,3,1,0,3,7,15,{"$f":"B491&\" \"&C491","v":"Lysický Sebastián"},{"$f":"IF(ISBLANK(F491),\"\",IF(F491<4,CHOOSE(F491,3,2,1),0)+G491)","v":2}]
["2016-12-10","Mec","Tobias",null,null,2,4,0,1,40,10,"Mec Tobias",6]
["2016-12-10","Kopcová","Eliška",null,null,4,1,0,4,10,40,"Kopcová Eliška",1]
["2016-12-10","Adamčíková","Nela",null,null,4,1,0,4,5,40,"Adamčíková Nela",1]
["2016-12-10","Kocmanová","Lucie",null,null,1,5,0,0,50,0,"Kocmanová Lucie",8]
["2016-12-10","Graňák","Dominik",null,null,5,0,0,5,0,32,"Graňák Dominik",0]
["2016-12-10","Káňová","Barbora",null,null,3,2,0,3,17,30,"Káňová Barbora",3]
["2016-12-10","Kopijas","Oliver",null,null,1,4,0,0,35,0,"Kopijas Oliver",7]
["2016-12-10","Vjaclovský","David",null,null,5,1,0,3,5,25,"Vjaclovský David",1]
["2016-12-10","Michálek","Jakub",null,null,4,1,0,3,5,30,"Michálek Jakub",1]

{"sheet":"Knt","index":2,"n_rows":248,"n_cols":28,"rows_kept":248,"cut":false,"hidden":true,"merged":[]}
["RZB - rozdíl vyhraných a prohraných"]
["PZB - poměr vyhraných a prohraných"]
[null,"Turnaj"]
[null,"2016-02-06",null,null,"2016-03-05",null,null,"2016-04-16",null,null,"2016-05-21",null,null,"2016-09-23",null,null,"2016-10-22",null,null,"2016-11-19",null,null,"2016-12-10",null,null,"Celkem Bodů","Celkem Součet z RZB","Celkem Součet z PZB"]
["Závodník","Bodů","Součet z RZB","Součet z PZB","Bodů","Součet z RZB","Součet z PZB","Bodů","Součet z RZB","Součet z PZB","Bodů","Součet z RZB","Součet z PZB","Bodů","Součet z RZB","Součet z PZB","Bodů","Součet z RZB","Součet z PZB","Bodů","Součet z RZB","Součet z PZB","Bodů","Součet z RZB","Součet z PZB"]
["Náplava Richard",5,2,0,3,0,1,5,2,0,6,3,0,7,4,0,4,1,2,0,0,0,4,1,1.5,34,13,3.6]
["To Adam",5,2,3,0,-3,0,6,2,3,5,2,0,7,4,0,7,4,0,3,2,3,0,0,0,33,13,3.1666666666666665]
["Vojkovský Dalibor",5,2,3,0,0,0,3,0,1,4,1,2,4,1,2,6,3,0,3,0,1,8,5,0,33,12,3.4]
["Lysický Sebastián",2,-1,0.5,2,-1,0.5,4,1,2,5,2,0,6,3,0,0,0,0,6,3,0,2,-2,0.33333333333333331,27,5,1.625]
["Rapčanová Alice",4,1,2,5,2,0,4,1,2,5,2,3,3,0,1,0,0,0,3,0,1,2,-1,0.5,26,5,1.7142857142857142]
["Pospíšil Jan",6,3,0,3,1,2,4,1,2,0,0,0,3,1,0,0,0,0,4,1,2,5,1,2,25,8,3]
["Kocmanová Lucie",0,0,0,4,1,2,0,0,0,5,2,0,0,0,0,0,0,0,7,4,0,8,5,0,24,12,13]
["Michálek Jakub",0,0,0,0,0,0,0,0,0,1,0,0,22,19,20,0,0,0,0,0,0,1,-2,0.33333333333333331,24,17,5.25]
["Valentík Tomáš",2,-1,0.5,6,3,0,1,-2,0.33333333333333331,0,0,0,0,0,0,5,2,0,4,1,2,5,2,0,23,5,1.8333333333333333]
["Nováček Nikolas",0,0,0,6,3,0,4,2,3,0,0,0,0,0,0,5,2,0,6,3,0,0,0,0,21,10,11]
["Nuhlíček Michal",0,0,0,0,0,0,2,0,1,0,0,0,0,0,0,4,1,2,7,4,0,7,4,0,20,9,4]
["Nuhlíček Jakub",0,0,0,0,-3,0,3,0,1,2,-1,0.5,0,0,0,6,3,0,2,0,1,7,4,0,20,3,1.3333333333333333]
["Bukovjanová Charlotte",0,0,0,0,0,0,6,3,0,6,3,0,0,-2,0,1,-2,0,2,-1,0.5,5,1,2,20,2,1.2857142857142858]
["Šotola Kryštof",0,0,0,4,1,2,1,-2,0,3,-1,0.5,4,1,2,2,-1,0.5,2,-19,0.05,4,1,2,20,-20,0.31034482758620691]
["Boháč Adam",0,0,0,0,0,0,0,0,0,0,0,0,0,0,0,6,2,3,7,4,0,6,3,4,19,9,5.5]
["Stark Vojtěch",3,0,1,2,-1,0.5,1,-1,0.5,1,-2,0,1,-2,0.33333333333333331,4,1,2,4,1,2,3,-1,0.5,19,-5,0.6428571428571429]
["Suchan Jan",4,1,2,0,0,0,5,2,3,3,0,1,6,3,0,0,0,0,0,0,0,1,-2,0,19,4,1.8]
["Čech Jiří",4,1,2,5,2,3,0,0,0,0,0,0,0,0,0,4,1,2,0,0,0,5,2,0,18,6,3]
["Ryška Filip",6,3,0,4,1,2,0,-4,0,4,1,2,0,0,0,3,1,2,0,0,0,0,0,0,17,2,1.2857142857142858]
["Ďuriš Vojtěch",6,3,0,0,0,0,0,0,0,0,0,0,0,0,0,6,3,0,0,0,0,5,2,0,17,8,0]
["Benáčková Denisa",3,0,1,0,-3,0,1,-2,0,3,1,0,0,0,0,2,0,1,2,-1,0.5,5,2,0,16,-3,0.66666666666666663]
["Turek Jakub",0,0,0,0,0,0,0,-3,0,7,4,0,5,2,3,0,0,0,4,1,2,0,0,0,16,4,1.8]
["Jakšík Daniel",4,1,2,7,4,0,0,0,0,0,0,0,0,0,0,5,2,0,0,0,0,0,0,0,16,7,8]
["Huvar Matyáš",0,0,0,6,3,0,0,0,0,3,0,1,0,0,0,0,0,0,6,3,0,0,0,0,15,6,7]
["Mec Tobias",3,1,2,0,0,0,0,0,0,0,0,0,0,0,0,6,3,0,0,0,0,6,3,4,15,7,4.5]
["Novotný Kryštof",6,3,0,3,1,2,0,0,0,0,0,0,0,0,0,6,3,0,0,0,0,0,0,0,15,7,8]
["Graňák Dominik",1,-1,0.5,0,-3,0,2,-1,0.5,5,2,0,6,2,3,1,-2,0.33333333333333331,0,0,0,0,-5,0,15,-8,0.5]
["Kožušník Václav",1,-1,0,0,0,0,0,0,0,0,0,0,1,-2,0.33333333333333331,0,0,0,6,3,0,7,4,0,15,4,2]
["Rapčanová Silvie",6,3,0,0,0,0,3,1,2,0,0,0,0,0,0,0,0,0,6,3,0,0,0,0,15,7,8]
["Brož Ondřej",2,-1,0.5,0,0,0,4,1,2,0,0,0,0,0,0,5,1,2,0,0,0,4,1,2,15,2,1.4]
["Mička Tomáš",5,2,0,6,3,0,1,-2,0.33333333333333331,3,0,1,0,0,0,0,0,0,0,0,0,0,0,0,15,3,1.75]
["Caletka Petr",1,-1,0,0,0,0,0,0,0,2,-1,0.5,0,0,0,5,2,3,7,4,0,0,0,0,15,4,2]
["Rapčanová Sylvie",0,0,0,0,0,0,0,0,0,5,2,0,6,3,0,0,0,0,0,0,0,3,0,1,14,5,6]
["Marný Jakub",5,2,0,0,0,0,0,0,0,5,2,0,0,0,0,0,0,0,4,1,0,0,0,0,14,5,0]
["Schotli Josef",3,0,1,0,0,0,4,1,2,3,-1,0.5,0,0,0,0,0,0,4,1,2,0,0,0,14,1,1.1666666666666667]
["Papavasilevský Marek",0,0,0,6,3,0,0,-3,0,0,0,0,7,4,0,0,0,0,0,0,0,0,0,0,13,4,2.3333333333333335]
["Salamonová Karolína",0,0,0,1,-2,0,6,3,0,6,3,0,0,0,0,0,0,0,0,0,0,0,0,0,13,4,3]
["Marvan Lukáš",0,0,0,0,0,0,0,0,0,0,0,0,3,0,1,4,0,1,6,3,0,0,0,0,13,3,1.75]
["Nováček Nicolas",6,3,0,0,0,0,0,0,0,3,0,1,4,1,2,0,0,0,0,0,0,0,0,0,13,4,3]
["Neuwirt Petr",7,4,0,6,3,0,0,0,0,0,0,0,0,0,0,0,0,0,0,0,0,0,0,0,13,7,0]
["Martinásek Šimon",0,0,0,0,0,0,0,0,0,0,0,0,0,-4,0,3,0,1,5,2,3,5,2,3,13,0,1]
["Neckář Matěj",7,4,0,5,2,3,0,0,0,0,0,0,0,0,0,0,0,0,0,0,0,0,0,0,12,6,7]
["Káňová Barbora",4,1,2,2,-1,0.5,0,0,0,0,0,0,0,0,0,3,0,1,0,0,0,3,-1,0.66666666666666663,12,-1,0.8571428571428571]
["Doubek Benjamin",6,3,0,2,-1,0.5,4,2,0,0,0,0,0,0,0,0,0,0,0,0,0,0,0,0,12,4,3]
["Leone Luca",7,4,0,0,0,0,0,0,0,0,0,0,3,0,1,0,0,0,2,-1,0.5,0,0,0,12,3,1.75]
["Vavřina Viktor",0,0,0,6,3,0,0,0,0,0,0,0,5,2,0,0,0,0,0,0,0,0,0,0,11,5,0]
["Bencúr Eliáš",0,0,0,1,-2,0.33333333333333331,4,1,2,6,3,0,0,0,0,0,0,0,0,0,0,0,0,0,11,2,1.5]
["Kaszperová Kristýna",0,0,0,0,0,0,0,0,0,0,0,0,0,0,0,0,0,0,5,2,0,6,3,0,11,5,0]
["Mikenda Ondřej",0,0,0,0,0,0,1,-2,0,3,-1,0.5,1,-2,0,0,-3,0,6,3,0,0,0,0,11,-5,0.44444444444444442]
["Krischke Fabian",0,0,0,0,0,0,2,-1,0.5,0,0,0,0,0,0,0,0,0,5,2,0,4,1,2,11,2,1.6666666666666667]
["Filipiak Adam",0,-1,0,0,0,0,0,0,0,0,0,0,0,0,0,6,3,0,2,-1,0.5,3,-1,0.5,11,0,1]
["Černý Michal",0,0,0,0,0,0,0,0,0,6,3,0,0,0,0,0,0,0,0,0,0,5,2,0,11,5,0]
["Končítek Kryštof",4,1,2,7,4,0,0,0,0,0,0,0,0,0,0,0,0,0,0,0,0,0,0,0,11,5,6]
["Křenek Jakub",0,0,0,5,2,3,6,3,0,0,0,0,0,0,0,0,0,0,0,0,0,0,0,0,11,5,6]
["Vavřinová Pavla",0,0,0,0,0,0,0,0,0,0,0,0,0,0,0,5,2,0,5,2,3,0,0,0,10,4,5]
["Kapias Oliver",0,0,0,0,0,0,0,0,0,0,0,0,0,0,0,7,4,0,3,0,1,0,0,0,10,4,3]
["Dvorský Denis",0,0,0,4,1,2,6,3,0,0,0,0,0,0,0,0,0,0,0,0,0,0,0,0,10,4,5]
["Řeha Daniel",0,0,0,4,2,0,6,3,0,0,0,0,0,0,0,0,0,0,0,0,0,0,0,0,10,5,0]
["Vjaclovský David",0,0,0,0,-3,0,0,0,0,0,0,0,0,0,0,5,2,3,4,1,2,1,-2,0.33333333333333331,10,-2,0.75]
["Žurek Sebastián",0,0,0,0,0,0,0,0,0,0,0,0,0,0,0,0,0,0,4,1,2,5,2,0,9,3,4]
["King Samuel",0,0,0,0,0,0,0,0,0,0,0,0,0,0,0,4,1,2,5,2,0,0,-3,0,9,0,1]
["Kulhánek Adam",0,0,0,0,0,0,0,0,0,0,0,0,0,0,0,4,1,2,0,0,0,5,1,2,9,2,2]
["Halagačka Jiří",5,2,0,4,1,2,0,0,0,0,0,0,0,0,0,0,0,0,0,0,0,0,0,0,9,3,4]
["Hisem Matěj",2,-1,0.5,7,4,0,0,0,0,0,0,0,0,0,0,0,0,0,0,0,0,0,0,0,9,3,2.5]
["Kolářová Valentýna",0,0,0,2,-1,0.5,7,4,0,0,0,0,0,0,0,0,0,0,0,0,0,0,0,0,9,3,2.5]
["Kolář Vojtěch",6,3,0,3,0,1,0,0,0,0,0,0,0,0,0,0,0,0,0,0,0,0,0,0,9,3,2.5]
["Sněhota Matyáš",0,0,0,4,1,2,0,0,0,0,0,0,0,0,0,0,0,0,0,0,0,4,1,2,8,2,2]
["Matějíčka Štěpán",0,0,0,0,0,0,0,0,0,0,0,0,3,0,1,5,2,0,0,0,0,0,0,0,8,2,3]
["Wilkus Richard",0,0,0,0,0,0,0,0,0,0,0,0,1,-2,0,2,-1,0.5,5,2,3,0,0,0,8,-1,0.8]
["Sedláček Jakub",0,0,0,7,4,0,0,0,0,0,0,0,0,0,0,0,0,0,0,0,0,0,0,0,7,4,0]
["Kopijas Oliver",0,0,0,0,0,0,0,0,0,0,0,0,0,0,0,0,0,0,0,0,0,7,4,0,7,4,0]
["Choleva Martin",0,0,0,7,4,0,0,0,0,0,0,0,0,0,0,0,0,0,0,0,0,0,0,0,7,4,0]
["Válek Prokop",1,-2,0.33333333333333331,2,-1,0.5,1,-2,0.33333333333333331,0,0,0,0,0,0,0,0,0,3,0,1,0,0,0,7,-5,0.44444444444444442]
["Románek Jakub",0,0,0,0,0,0,0,0,0,0,0,0,0,0,0,4,1,2,3,0,1,0,0,0,7,1,1.5]
["Siekiera Jakub",7,4,0,0,0,0,0,0,0,0,0,0,0,0,0,0,0,0,0,0,0,0,0,0,7,4,0]
["Havelka Josef",1,-2,0.33333333333333331,2,-1,0.5,4,1,2,0,0,0,0,0,0,0,0,0,0,0,0,0,0,0,7,-2,0.66666666666666663]
["Černá Veronika",0,0,0,0,0,0,0,0,0,0,0,0,3,2,0,0,0,0,2,-1,0.5,2,-2,0.33333333333333331,7,-1,0.8]
["Líbenek Štěpán",0,0,0,0,0,0,7,4,0,0,0,0,0,0,0,0,0,0,0,0,0,0,0,0,7,4,0]
["Wojtas Ines",0,0,0,0,0,0,0,0,0,0,0,0,0,0,0,3,-1,0.5,4,0,1,0,0,0,7,-1,0.75]
["Kristen Vilém",0,0,0,0,0,0,0,0,0,0,0,0,0,0,0,5,2,0,1,-2,0.33333333333333331,1,-3,0.25,7,-3,0.5714285714285714]
["Wi Alex",0,0,0,0,0,0,6,3,0,1,-1,0,0,0,0,0,0,0,0,0,0,0,0,0,7,2,3]
["Žmuda Maja",6,3,0,0,0,0,0,0,0,0,0,0,0,0,0,0,0,0,0,0,0,0,0,0,6,3,0]
["Caletka Michal",1,-2,0,0,0,0,0,0,0,2,-1,0.5,0,0,0,3,0,1,0,-3,0,0,0,0,6,-6,0.25]
["Gal Richard",6,3,0,0,0,0,0,0,0,0,0,0,0,0,0,0,0,0,0,0,0,0,0,0,6,3,0]
["Urban Matěj",0,0,0,6,3,0,0,0,0,0,0,0,0,0,0,0,0,0,0,0,0,0,0,0,6,3,0]
["Brada Tomáš",0,0,0,6,3,0,0,0,0,0,0,0,0,0,0,0,0,0,0,0,0,0,0,0,6,3,0]
["Grym Petr",3,0,1,3,1,0,0,0,0,0,0,0,0,0,0,0,0,0,0,0,0,0,0,0,6,1,1.5]
["Mohyla David",4,1,2,0,0,0,0,0,0,0,0,0,0,0,0,2,0,1,0,0,0,0,0,0,6,1,1.5]
["Muráň Tomáš",5,2,3,0,0,0,0,0,0,1,-2,0.33333333333333331,0,0,0,0,0,0,0,0,0,0,0,0,6,0,1]
["Pindor Miroslav",4,1,0,0,0,0,2,-1,0.5,0,0,0,0,0,0,0,0,0,0,0,0,0,0,0,6,0,1]
["Rojíček Jan",0,0,0,0,0,0,6,3,0,0,0,0,0,0,0,0,0,0,0,0,0,0,0,0,6,3,0]
["Tomek Vojtěch",0,0,0,0,0,0,0,0,0,0,0,0,0,0,0,0,0,0,6,3,0,0,0,0,6,3,0]
["Vrbas Alexandr",0,0,0,6,3,0,0,0,0,0,0,0,0,0,0,0,0,0,0,0,0,0,0,0,6,3,0]
["Schwarz Šimon",0,0,0,0,0,0,0,0,0,0,0,0,0,0,0,6,3,0,0,0,0,0,0,0,6,3,0]
["Krischke Simon",0,0,0,0,0,0,0,0,0,0,0,0,0,0,0,0,0,0,0,0,0,6,3,0,6,3,0]
["Vrbas Alexander",0,0,0,0,0,0,0,0,0,1,-1,0.5,5,2,3,0,0,0,0,0,0,0,0,0,6,1,1.3333333333333333]
["Beutel David",6,3,0,0,0,0,0,0,0,0,0,0,0,0,0,0,0,0,0,0,0,0,0,0,6,3,0]
["Kolář Václav",0,0,0,4,1,2,1,-2,0.33333333333333331,0,0,0,0,0,0,0,0,0,0,0,0,0,0,0,5,-1,0.75]
["Přikryl Tomáš",0,0,0,0,0,0,5,2,0,0,0,0,0,0,0,0,0,0,0,0,0,0,0,0,5,2,0]
["Holaň Erik",0,0,0,0,0,0,0,0,0,0,0,0,0,0,0,0,0,0,2,-1,0.5,3,0,1,5,-1,0.66666666666666663]
["Válek Matěj",0,0,0,1,-2,0.33333333333333331,0,0,0,4,1,2,0,0,0,0,0,0,0,0,0,0,0,0,5,-1,0.75]
["Matušek Jakub",0,0,0,1,-2,0.33333333333333331,0,0,0,0,0,0,4,1,2,0,0,0,0,0,0,0,0,0,5,-1,0.75]
["Vlaškovský Lukáš",0,0,0,0,0,0,5,2,3,0,-2,0,0,0,0,0,0,0,0,0,0,0,0,0,5,0,1]
["Kožušník Vojtěch",5,2,0,0,0,0,0,0,0,0,0,0,0,0,0,0,0,0,0,0,0,0,0,0,5,2,0]
["Weiser Mikuláš",0,0,0,0,0,0,0,0,0,0,0,0,2,-2,0,3,-1,0.5,0,0,0,0,0,0,5,-3,0.25]
["Strachota Vojtěch",0,0,0,0,0,0,5,2,0,0,0,0,0,0,0,0,0,0,0,0,0,0,0,0,5,2,0]
["Šebesta Jakub",0,0,0,0,0,0,0,0,0,0,0,0,0,0,0,0,0,0,5,1,2,0,0,0,5,1,2]
["Salzman Václav",5,2,3,0,0,0,0,0,0,0,0,0,0,0,0,0,0,0,0,0,0,0,0,0,5,2,3]
["Hegner Leoš",0,0,0,0,0,0,0,0,0,0,0,0,5,2,0,0,0,0,0,0,0,0,0,0,5,2,0]
["Salek Natalia",0,0,0,5,2,3,0,0,0,0,0,0,0,0,0,0,0,0,0,0,0,0,0,0,5,2,3]
["Kristýna Kazsperová",0,0,0,0,0,0,0,0,0,0,0,0,5,2,0,0,0,0,0,0,0,0,0,0,5,2,0]
["Mikendová Tereza",0,0,0,0,0,0,0,0,0,0,0,0,0,0,0,0,0,0,5,2,0,0,0,0,5,2,0]
["Hladík Václav",0,0,0,0,0,0,0,0,0,0,-3,0,2,-1,0.5,3,0,1,0,0,0,0,0,0,5,-4,0.33333333333333331]
["Ciora Jakub",0,0,0,0,0,0,0,0,0,0,0,0,0,0,0,0,0,0,1,-2,0.33333333333333331,3,0,1,4,-2,0.6]
["Sedláček Vojtěch",0,0,0,4,1,0,0,0,0,0,0,0,0,0,0,0,0,0,0,0,0,0,0,0,4,1,0]
["Kolář  Václav",0,0,0,0,0,0,0,0,0,0,0,0,0,0,0,0,0,0,0,0,0,4,1,2,4,1,2]
["Buček Dan",1,-2,0.33333333333333331,0,0,0,2,-1,0.5,0,-3,0,0,-2,0,0,0,0,1,-2,0,0,-3,0,4,-13,0.13333333333333333]
["Kopcová Eliška",0,0,0,0,0,0,0,0,0,0,0,0,0,0,0,2,-1,0.5,1,-2,0.33333333333333331,1,-3,0.25,4,-6,0.33333333333333331]
["Skácel Antonín",0,0,0,0,0,0,4,1,2,0,0,0,0,0,0,0,0,0,0,0,0,0,0,0,4,1,2]
["Lukas Daniel",0,0,0,0,0,0,0,0,0,0,0,0,0,0,0,0,0,0,4,1,2,0,0,0,4,1,2]
["Pabjan Tomáš",4,1,2,0,0,0,0,0,0,0,0,0,0,0,0,0,0,0,0,0,0,0,0,0,4,1,2]
["Remo Dominik",0,0,0,0,0,0,0,0,0,4,0,1,0,-4,0,0,0,0,0,0,0,0,0,0,4,-4,0.33333333333333331]
["Bača Nicolas",4,1,2,0,0,0,0,0,0,0,0,0,0,0,0,0,0,0,0,0,0,0,0,0,4,1,2]
["Gil Mikolaj",0,0,0,4,1,2,0,0,0,0,0,0,0,0,0,0,0,0,0,0,0,0,0,0,4,1,2]
["Míčka Tomáš",0,0,0,0,0,0,0,0,0,0,0,0,0,-3,0,0,0,0,4,1,2,0,0,0,4,-2,0.5]
["Kajfosz Kryštof",0,0,0,0,0,0,0,0,0,0,0,0,0,0,0,0,0,0,4,4,0,0,0,0,4,4,0]
["Glac Adam",4,1,2,0,0,0,0,0,0,0,0,0,0,0,0,0,0,0,0,0,0,0,0,0,4,1,2]
["Havelka Štěpán",0,0,0,1,-2,0,3,1,2,0,0,0,0,0,0,0,0,0,0,0,0,0,0,0,4,-1,0.66666666666666663]
["Muraň Tomáš",0,0,0,4,0,1,0,0,0,0,0,0,0,0,0,0,0,0,0,0,0,0,0,0,4,0,1]
["Baudiš Michal",0,0,0,0,0,0,2,-1,0.5,0,0,0,0,0,0,2,-1,0.5,0,0,0,0,0,0,4,-2,0.5]
["Siekera Jakub",0,0,0,4,1,2,0,0,0,0,0,0,0,0,0,0,0,0,0,0,0,0,0,0,4,1,2]
["Hranický Václav",4,1,2,0,0,0,0,0,0,0,0,0,0,0,0,0,0,0,0,0,0,0,0,0,4,1,2]
["Zakaryan Erik",1,-2,0,0,0,0,0,0,0,0,0,0,2,-1,0.5,0,0,0,0,0,0,1,-3,0.25,4,-6,0.25]
["Žmuda Julia",4,1,2,0,0,0,0,0,0,0,0,0,0,0,0,0,0,0,0,0,0,0,0,0,4,1,2]
["Pitrman Daniel",0,0,0,0,0,0,0,0,0,0,0,0,0,0,0,0,0,0,0,0,0,3,0,1,3,0,1]
["Čapek Dominik",2,-1,0.5,0,0,0,0,0,0,1,-2,0,0,0,0,0,0,0,0,0,0,0,0,0,3,-3,0.25]
["Adamus Jan",0,0,0,0,0,0,0,0,0,0,0,0,0,0,0,0,0,0,3,0,1,0,0,0,3,0,1]
["Nováková Emma",0,0,0,0,0,0,0,0,0,0,0,0,1,-2,0,2,0,1,0,-3,0,0,0,0,3,-5,0.16666666666666666]
["Čáp Tommy",0,0,0,0,0,0,0,0,0,0,0,0,0,0,0,0,0,0,0,0,0,3,-1,0.5,3,-1,0.5]
["Macháček Matyáš",0,0,0,0,0,0,3,0,1,0,0,0,0,0,0,0,0,0,0,0,0,0,0,0,3,0,1]
["Brezoňák Jakub",3,0,1,0,0,0,0,0,0,0,0,0,0,0,0,0,0,0,0,0,0,0,0,0,3,0,1]
["Nekoranec Vojtěch",0,0,0,0,0,0,0,0,0,0,0,0,0,0,0,1,-3,0,2,-1,0.5,0,0,0,3,-4,0.2]
["Fajkus Adrian",0,-3,0,0,0,0,0,0,0,3,0,1,0,0,0,0,0,0,0,0,0,0,0,0,3,-3,0.4]
["Smyček Martin",0,0,0,0,0,0,0,0,0,0,0,0,0,0,0,0,-2,0,0,0,0,3,-1,0.5,3,-3,0.25]
["Knop Jakub",3,0,1,0,0,0,0,0,0,0,0,0,0,0,0,0,0,0,0,0,0,0,0,0,3,0,1]
["Římánek Petr",0,0,0,2,-1,0.5,0,0,0,1,-2,0.33333333333333331,0,0,0,0,0,0,0,-3,0,0,0,0,3,-6,0.25]
["Tarkovský Tomáš",0,0,0,3,0,1,0,0,0,0,0,0,0,0,0,0,0,0,0,0,0,0,0,0,3,0,1]
["Štěpnička Matyáš",3,1,2,0,0,0,0,0,0,0,0,0,0,0,0,0,0,0,0,0,0,0,0,0,3,1,2]
["Volná Valerie",0,0,0,0,0,0,0,0,0,3,0,1,0,0,0,0,0,0,0,0,0,0,0,0,3,0,1]
["Fojtík Jiří",0,0,0,0,0,0,0,0,0,0,0,0,2,0,1,1,-2,0.33333333333333331,0,0,0,0,0,0,3,-2,0.6]
["Zach Jan",3,0,1,0,0,0,0,0,0,0,0,0,0,0,0,0,0,0,0,0,0,0,0,0,3,0,1]
["Kubala Marek",0,0,0,0,0,0,0,0,0,0,0,0,0,0,0,0,0,0,0,-3,0,3,-1,0.5,3,-4,0.2]
["Suchan Matěj",0,0,0,3,0,1,0,0,0,0,0,0,0,0,0,0,0,0,0,0,0,0,0,0,3,0,1]
["Němec Patrik",0,0,0,0,0,0,0,0,0,0,0,0,0,0,0,0,0,0,2,-1,0.5,0,0,0,2,-1,0.5]
["Görčoš Václav",0,0,0,0,0,0,0,0,0,0,0,0,0,0,0,2,-1,0.5,0,0,0,0,0,0,2,-1,0.5]
["Gelnar Lukáš",0,0,0,0,0,0,0,0,0,0,0,0,0,0,0,0,0,0,0,0,0,2,-3,0,2,-3,0]
["Rybář Adam",2,-1,0.5,0,0,0,0,0,0,0,0,0,0,0,0,0,0,0,0,0,0,0,0,0,2,-1,0.5]
["Adamus Jiří",0,0,0,0,0,0,0,0,0,0,0,0,0,0,0,0,0,0,2,-1,0.5,0,0,0,2,-1,0.5]
["Revťáková Magdaléna",2,-1,0.5,0,0,0,0,0,0,0,0,0,0,0,0,0,0,0,0,0,0,0,0,0,2,-1,0.5]
["Záruba Pavel",0,0,0,0,0,0,0,0,0,0,0,0,0,0,0,0,0,0,2,-2,0.33333333333333331,0,0,0,2,-2,0.33333333333333331]
["Prášek Filip",0,0,0,0,0,0,0,0,0,2,-2,0,0,0,0,0,0,0,0,0,0,0,0,0,2,-2,0]
["Mecnerová Adéla",0,0,0,0,0,0,2,-1,0.5,0,0,0,0,0,0,0,0,0,0,0,0,0,0,0,2,-1,0.5]
["Dinaj Tomáš",0,0,0,0,0,0,0,0,0,2,-1,0.5,0,0,0,0,0,0,0,0,0,0,0,0,2,-1,0.5]
["Morcinek Lukáš",0,0,0,0,0,0,0,0,0,0,0,0,0,0,0,1,-3,0,1,-2,0.33333333333333331,0,0,0,2,-5,0.16666666666666666]
["Jahodová Petra",0,0,0,0,0,0,0,0,0,0,0,0,2,-1,0.5,0,0,0,0,0,0,0,0,0,2,-1,0.5]
["Dastych Filip",0,0,0,0,0,0,0,0,0,0,0,0,0,0,0,0,0,0,0,-3,0,2,-1,0.5,2,-4,0.2]
["Šotolu Kryštof",2,-1,0.5,0,0,0,0,0,0,0,0,0,0,0,0,0,0,0,0,0,0,0,0,0,2,-1,0.5]
["Neumannová Karolína",0,0,0,0,0,0,0,0,0,0,0,0,0,0,0,0,0,0,2,-1,0,0,0,0,2,-1,0]
["Kobiernicki Marek",2,0,0,0,0,0,0,0,0,0,0,0,0,0,0,0,0,0,0,0,0,0,0,0,2,0,0]
["Vránová Eva",0,0,0,2,-1,0.5,0,0,0,0,0,0,0,0,0,0,0,0,0,0,0,0,0,0,2,-1,0.5]
["Urban Filip",0,0,0,0,0,0,0,0,0,0,0,0,2,-1,0.5,0,0,0,0,0,0,0,0,0,2,-1,0.5]
["Závodný Matyáš",0,0,0,0,0,0,0,0,0,0,0,0,0,0,0,0,0,0,0,0,0,2,0,1,2,0,1]
["Kubík Lukáš",0,0,0,0,0,0,0,0,0,0,0,0,0,0,0,2,-1,0.5,0,0,0,0,0,0,2,-1,0.5]
["Švejnoh Maxmilián",0,0,0,0,0,0,0,0,0,0,0,0,0,0,0,0,0,0,0,0,0,2,-1,0.5,2,-1,0.5]
["Dvořák Adam",0,0,0,0,-4,0,2,-1,0.5,0,0,0,0,0,0,0,0,0,0,0,0,0,0,0,2,-5,0.16666666666666666]
["Děrgelová Adéla",0,0,0,2,-1,0.5,0,0,0,0,0,0,0,0,0,0,0,0,0,0,0,0,0,0,2,-1,0.5]
["Pavlík Adam",1,-2,0.33333333333333331,0,0,0,0,0,0,0,0,0,0,0,0,0,0,0,0,0,0,0,0,0,1,-2,0.33333333333333331]
["Balada Petr",0,0,0,0,0,0,0,0,0,0,0,0,0,0,0,0,0,0,0,0,0,1,-2,0,1,-2,0]
["Fránek Daniel",0,0,0,0,0,0,0,0,0,1,-2,0,0,0,0,0,0,0,0,0,0,0,0,0,1,-2,0]
["Pavlík Lukáš",0,0,0,0,0,0,0,0,0,0,0,0,0,0,0,0,0,0,1,-1,0.5,0,-4,0,1,-5,0.16666666666666666]
["Boráňová Lenka",1,-2,0.33333333333333331,0,0,0,0,0,0,0,0,0,0,0,0,0,0,0,0,0,0,0,0,0,1,-2,0.33333333333333331]
["Twirda Daniela",1,-2,0,0,0,0,0,0,0,0,0,0,0,0,0,0,0,0,0,0,0,0,0,0,1,-2,0]
["Buřil Marek",1,-2,0.33333333333333331,0,0,0,0,0,0,0,0,0,0,0,0,0,0,0,0,0,0,0,0,0,1,-2,0.33333333333333331]
["Ponča Tomáš",0,0,0,0,0,0,0,0,0,0,-2,0,0,0,0,0,0,0,1,-2,0.33333333333333331,0,0,0,1,-4,0.2]
["Smolka František",0,0,0,0,0,0,1,-2,0,0,0,0,0,0,0,0,0,0,0,0,0,0,0,0,1,-2,0]
["Slowik Nikolas",0,0,0,0,0,0,0,0,0,0,0,0,0,0,0,1,-1,0.5,0,0,0,0,0,0,1,-1,0.5]
["Koch Martin",0,0,0,0,0,0,0,0,0,0,0,0,0,0,0,0,0,0,0,0,0,1,-3,0.25,1,-3,0.25]
["Nenička František",1,-2,0,0,0,0,0,0,0,0,0,0,0,0,0,0,0,0,0,0,0,0,0,0,1,-2,0]
["Adamčíková Nela",0,0,0,0,0,0,0,0,0,0,0,0,0,0,0,0,0,0,0,0,0,1,-3,0.25,1,-3,0.25]
["Rodryčová Adéla",0,0,0,1,-2,0.33333333333333331,0,0,0,0,0,0,0,0,0,0,0,0,0,0,0,0,0,0,1,-2,0.33333333333333331]
["Kotouček Marek",0,0,0,0,0,0,0,0,0,0,0,0,0,0,0,0,0,0,0,-3,0,1,-2,0,1,-5,0]
["Pindor Mirek",0,0,0,1,-2,0.33333333333333331,0,0,0,0,0,0,0,0,0,0,0,0,0,0,0,0,0,0,1,-2,0.33333333333333331]
["Grigarčíková Barbora",0,0,0,0,0,0,0,0,0,0,0,0,0,0,0,0,0,0,1,-2,0,0,0,0,1,-2,0]
["Holík Denis",0,0,0,0,0,0,0,0,0,1,-2,0,0,0,0,0,0,0,0,0,0,0,0,0,1,-2,0]
["Janková Karolína",0,0,0,0,0,0,0,0,0,0,0,0,0,0,0,0,0,0,1,-2,0,0,0,0,1,-2,0]
["Starý Patrik",0,0,0,0,0,0,0,0,0,0,0,0,0,0,0,1,-2,0.33333333333333331,0,-3,0,0,-4,0,1,-9,0.1]
["Vlk František",0,0,0,0,0,0,0,0,0,0,0,0,0,0,0,0,0,0,1,-2,0,0,0,0,1,-2,0]
["Jakšík Petr",0,0,0,0,0,0,0,0,0,0,0,0,0,0,0,1,-2,0.33333333333333331,0,0,0,0,0,0,1,-2,0.33333333333333331]
["Šnapka Marek",0,0,0,0,0,0,0,0,0,0,0,0,0,0,0,0,0,0,0,0,0,1,-1,0.5,1,-1,0.5]
["Dvořák Josef",0,0,0,0,0,0,0,0,0,0,0,0,0,0,0,1,-1,0.5,0,0,0,0,0,0,1,-1,0.5]
["Marcinek Lukáš",0,0,0,0,0,0,0,0,0,0,0,0,0,0,0,0,0,0,0,0,0,1,-2,0,1,-2,0]
["Koběrský Marek",0,0,0,1,-2,0.33333333333333331,0,0,0,0,0,0,0,0,0,0,0,0,0,0,0,0,0,0,1,-2,0.33333333333333331]
["Linhartová Alexandra",0,0,0,1,-2,0.33333333333333331,0,0,0,0,0,0,0,0,0,0,0,0,0,0,0,0,0,0,1,-2,0.33333333333333331]
["Buranyč Filip",1,-2,0,0,0,0,0,0,0,0,0,0,0,0,0,0,0,0,0,0,0,0,0,0,1,-2,0]
["Kopecký Patrik",0,0,0,1,-2,0.33333333333333331,0,0,0,0,0,0,0,0,0,0,0,0,0,0,0,0,0,0,1,-2,0.33333333333333331]
["Šimkovič Ondřej",0,0,0,0,0,0,0,-3,0,0,0,0,0,0,0,1,-2,0,0,0,0,0,0,0,1,-5,0]
["Rabčanová Sylvie",0,0,0,0,-3,0,0,0,0,0,0,0,0,0,0,0,0,0,0,0,0,0,0,0,0,-3,0]
["Kubíková Rosalie",0,0,0,0,-3,0,0,0,0,0,0,0,0,0,0,0,0,0,0,0,0,0,0,0,0,-3,0]
["Kobeljáková Carolína",0,-3,0,0,0,0,0,0,0,0,0,0,0,0,0,0,0,0,0,0,0,0,0,0,0,-3,0]
["Večeřa Jiří",0,-3,0,0,0,0,0,0,0,0,0,0,0,-4,0,0,0,0,0,0,0,0,0,0,0,-7,0]
["Rošicová Eliška",0,0,0,0,0,0,0,0,0,0,0,0,0,0,0,0,0,0,0,0,0,0,-4,0,0,-4,0]
["Molkovčák Matěj",0,-3,0,0,0,0,0,0,0,0,0,0,0,0,0,0,0,0,0,0,0,0,0,0,0,-3,0]
["Pindor Štěpán",0,0,0,0,0,0,0,0,0,0,0,0,0,0,0,0,-3,0,0,0,0,0,0,0,0,-3,0]
["Michalczyková Anna",0,-3,0,0,0,0,0,0,0,0,0,0,0,0,0,0,0,0,0,0,0,0,0,0,0,-3,0]
["Kobeljáková Barbora",0,-3,0,0,0,0,0,0,0,0,0,0,0,0,0,0,0,0,0,0,0,0,0,0,0,-3,0]
["Michálek Jaub",0,0,0,0,-3,0,0,0,0,0,0,0,0,0,0,0,0,0,0,0,0,0,0,0,0,-3,0]
["Novák Matyáš",0,0,0,0,0,0,0,-3,0,0,0,0,0,0,0,0,0,0,0,0,0,0,0,0,0,-3,0]
["Moraň Tomáš",0,0,0,0,0,0,0,0,0,0,0,0,0,0,0,0,0,0,0,-3,0,0,0,0,0,-3,0]
["Peter Matyáš",0,-3,0,0,0,0,0,0,0,0,0,0,0,-3,0,0,0,0,0,-3,0,0,0,0,0,-9,0]
["Homola Martin",0,0,0,0,-4,0,0,0,0,0,0,0,0,0,0,0,0,0,0,0,0,0,0,0,0,-4,0]
["Suchánek Aleš",0,0,0,0,0,0,0,0,0,0,0,0,0,0,0,0,-3,0,0,0,0,0,0,0,0,-3,0]
["Trelova Klára Annu",0,-3,0,0,0,0,0,0,0,0,0,0,0,0,0,0,0,0,0,0,0,0,0,0,0,-3,0]
["Bůček Dan",0,0,0,0,0,0,0,0,0,0,0,0,0,0,0,0,-3,0,0,0,0,0,0,0,0,-3,0]
["Bukovjanová Charlote",0,0,0,0,-4,0,0,0,0,0,0,0,0,0,0,0,0,0,0,0,0,0,0,0,0,-4,0]
["Verbík Vojtěch",0,-4,0,0,0,0,0,0,0,0,0,0,0,0,0,0,0,0,0,0,0,0,0,0,0,-4,0]
["Jurček Vojtěch",0,0,0,0,-3,0,0,0,0,0,0,0,0,0,0,0,0,0,0,0,0,0,0,0,0,-3,0]
["Sikora Tomáš",0,0,0,0,0,0,0,0,0,0,0,0,0,0,0,0,-3,0,0,0,0,0,0,0,0,-3,0]
["Bláhová Alexandra",0,0,0,0,0,0,0,0,0,0,0,0,0,0,0,0,0,0,0,-3,0,0,0,0,0,-3,0]
["Petr Matyáš",0,0,0,0,-3,0,0,0,0,0,0,0,0,0,0,0,0,0,0,0,0,0,0,0,0,-3,0]
["Doležal Martin",0,-3,0,0,0,0,0,0,0,0,0,0,0,0,0,0,0,0,0,0,0,0,-4,0,0,-7,0]
["Twirdá Daniela",0,0,0,0,0,0,0,-3,0,0,0,0,0,0,0,0,0,0,0,0,0,0,0,0,0,-3,0]
["Štaffa Ondřej",0,-4,0,0,0,0,0,0,0,0,0,0,0,0,0,0,0,0,0,0,0,0,0,0,0,-4,0]
["Pravda  Adam",0,-2,0,0,0,0,0,0,0,0,0,0,0,0,0,0,0,0,0,0,0,0,0,0,0,-2,0]
["Titz Boris",0,0,0,0,0,0,0,-4,0,0,0,0,0,0,0,0,0,0,0,0,0,0,0,0,0,-4,0]
["Hodák Daniel",0,0,0,0,0,0,0,0,0,0,0,0,0,-3,0,0,-3,0,0,0,0,0,0,0,0,-6,0]
["Bonczek Jakub",0,-2,0,0,-3,0,0,0,0,0,0,0,0,0,0,0,0,0,0,0,0,0,0,0,0,-5,0]
["Vlček  Lukáš",0,0,0,0,0,0,0,-2,0,0,0,0,0,0,0,0,0,0,0,0,0,0,0,0,0,-2,0]
["Smyček Patrik",0,0,0,0,0,0,0,0,0,0,0,0,0,0,0,0,0,0,0,-4,0,0,0,0,0,-4,0]
["Čechová Klára",0,-2,0,0,0,0,0,0,0,0,0,0,0,0,0,0,0,0,0,0,0,0,0,0,0,-2,0]
["Beikel Lukáš",0,-4,0,0,0,0,0,0,0,0,0,0,0,0,0,0,0,0,0,0,0,0,0,0,0,-4,0]
["Kusin Oliver",0,0,0,0,0,0,0,0,0,0,0,0,0,0,0,0,0,0,0,-4,0,0,0,0,0,-4,0]
["Večeřa Adam",0,-3,0,0,0,0,0,0,0,0,0,0,0,0,0,0,0,0,0,0,0,0,0,0,0,-3,0]
["Stebnická Lucie",0,0,0,0,0,0,0,0,0,0,0,0,0,0,0,0,0,0,0,-3,0,0,0,0,0,-3,0]

{"sheet":"Seřazení Knt","index":3,"n_rows":121,"n_cols":4,"rows_kept":121,"cut":false,"hidden":false,"merged":[]}
[{"$f":"Knt!A5","v":"Závodník"},"Celkem Bodů","Celkem Součet z RZB","Celkem Součet z PZB"]
[{"$f":"IF(Knt!A6=\" \",0,Knt!A6)","v":"Náplava Richard"},{"$f":"IF(ISERR(GETPIVOTDATA(\"Bodů\",Knt!$A$3,\"příjmení a jméno\",$A2)),-1,GETPIVOTDATA(\"Bodů\",Knt!$A$3,\"příjmení a jméno\",$A2))","v":34},{"$f":"IF(ISERR(GETPIVOTDATA(\"Součet z RZB\",Knt!$A$3,\"příjmení a jméno\",$A2)),0,GETPIVOTDATA(\"Součet z RZB\",Knt!$A$3,\"příjmení a jméno\",$A2))","v":13},{"$f":"IF(ISERR(GETPIVOTDATA(\"Součet z PZB\",Knt!$A$3,\"příjmení a jméno\",$A2)),0,GETPIVOTDATA(\"Součet z PZB\",Knt!$A$3,\"příjmení a jméno\",$A2))","v":3.6}]
[{"$f":"IF(Knt!A7=\" \",0,Knt!A7)","v":"To Adam"},{"$f":"IF(ISERR(GETPIVOTDATA(\"Bodů\",Knt!$A$3,\"příjmení a jméno\",$A3)),-1,GETPIVOTDATA(\"Bodů\",Knt!$A$3,\"příjmení a jméno\",$A3))","v":33},{"$f":"IF(ISERR(GETPIVOTDATA(\"Součet z RZB\",Knt!$A$3,\"příjmení a jméno\",$A3)),0,GETPIVOTDATA(\"Součet z RZB\",Knt!$A$3,\"příjmení a jméno\",$A3))","v":13},{"$f":"IF(ISERR(GETPIVOTDATA(\"Součet z PZB\",Knt!$A$3,\"příjmení a jméno\",$A3)),0,GETPIVOTDATA(\"Součet z PZB\",Knt!$A$3,\"příjmení a jméno\",$A3))","v":3.1666666666666665}]
[{"$f":"IF(Knt!A8=\" \",0,Knt!A8)","v":"Vojkovský Dalibor"},{"$f":"IF(ISERR(GETPIVOTDATA(\"Bodů\",Knt!$A$3,\"příjmení a jméno\",$A4)),-1,GETPIVOTDATA(\"Bodů\",Knt!$A$3,\"příjmení a jméno\",$A4))","v":33},{"$f":"IF(ISERR(GETPIVOTDATA(\"Součet z RZB\",Knt!$A$3,\"příjmení a jméno\",$A4)),0,GETPIVOTDATA(\"Součet z RZB\",Knt!$A$3,\"příjmení a jméno\",$A4))","v":12},{"$f":"IF(ISERR(GETPIVOTDATA(\"Součet z PZB\",Knt!$A$3,\"příjmení a jméno\",$A4)),0,GETPIVOTDATA(\"Součet z PZB\",Knt!$A$3,\"příjmení a jméno\",$A4))","v":3.4}]
[{"$f":"IF(Knt!A9=\" \",0,Knt!A9)","v":"Lysický Sebastián"},{"$f":"IF(ISERR(GETPIVOTDATA(\"Bodů\",Knt!$A$3,\"příjmení a jméno\",$A5)),-1,GETPIVOTDATA(\"Bodů\",Knt!$A$3,\"příjmení a jméno\",$A5))","v":27},{"$f":"IF(ISERR(GETPIVOTDATA(\"Součet z RZB\",Knt!$A$3,\"příjmení a jméno\",$A5)),0,GETPIVOTDATA(\"Součet z RZB\",Knt!$A$3,\"příjmení a jméno\",$A5))","v":5},{"$f":"IF(ISERR(GETPIVOTDATA(\"Součet z PZB\",Knt!$A$3,\"příjmení a jméno\",$A5)),0,GETPIVOTDATA(\"Součet z PZB\",Knt!$A$3,\"příjmení a jméno\",$A5))","v":1.625}]
[{"$f":"IF(Knt!A10=\" \",0,Knt!A10)","v":"Rapčanová Alice"},{"$f":"IF(ISERR(GETPIVOTDATA(\"Bodů\",Knt!$A$3,\"příjmení a jméno\",$A6)),-1,GETPIVOTDATA(\"Bodů\",Knt!$A$3,\"příjmení a jméno\",$A6))","v":26},{"$f":"IF(ISERR(GETPIVOTDATA(\"Součet z RZB\",Knt!$A$3,\"příjmení a jméno\",$A6)),0,GETPIVOTDATA(\"Součet z RZB\",Knt!$A$3,\"příjmení a jméno\",$A6))","v":5},{"$f":"IF(ISERR(GETPIVOTDATA(\"Součet z PZB\",Knt!$A$3,\"příjmení a jméno\",$A6)),0,GETPIVOTDATA(\"Součet z PZB\",Knt!$A$3,\"příjmení a jméno\",$A6))","v":1.7142857142857142}]
[{"$f":"IF(Knt!A11=\" \",0,Knt!A11)","v":"Pospíšil Jan"},{"$f":"IF(ISERR(GETPIVOTDATA(\"Bodů\",Knt!$A$3,\"příjmení a jméno\",$A7)),-1,GETPIVOTDATA(\"Bodů\",Knt!$A$3,\"příjmení a jméno\",$A7))","v":25},{"$f":"IF(ISERR(GETPIVOTDATA(\"Součet z RZB\",Knt!$A$3,\"příjmení a jméno\",$A7)),0,GETPIVOTDATA(\"Součet z RZB\",Knt!$A$3,\"příjmení a jméno\",$A7))","v":8},{"$f":"IF(ISERR(GETPIVOTDATA(\"Součet z PZB\",Knt!$A$3,\"příjmení a jméno\",$A7)),0,GETPIVOTDATA(\"Součet z PZB\",Knt!$A$3,\"příjmení a jméno\",$A7))","v":3}]
[{"$f":"IF(Knt!A13=\" \",0,Knt!A13)","v":"Michálek Jakub"},{"$f":"IF(ISERR(GETPIVOTDATA(\"Bodů\",Knt!$A$3,\"příjmení a jméno\",$A8)),-1,GETPIVOTDATA(\"Bodů\",Knt!$A$3,\"příjmení a jméno\",$A8))","v":24},{"$f":"IF(ISERR(GETPIVOTDATA(\"Součet z RZB\",Knt!$A$3,\"příjmení a jméno\",$A8)),0,GETPIVOTDATA(\"Součet z RZB\",Knt!$A$3,\"příjmení a jméno\",$A8))","v":17},{"$f":"IF(ISERR(GETPIVOTDATA(\"Součet z PZB\",Knt!$A$3,\"příjmení a jméno\",$A8)),0,GETPIVOTDATA(\"Součet z PZB\",Knt!$A$3,\"příjmení a jméno\",$A8))","v":5.25}]
[{"$f":"IF(Knt!A12=\" \",0,Knt!A12)","v":"Kocmanová Lucie"},{"$f":"IF(ISERR(GETPIVOTDATA(\"Bodů\",Knt!$A$3,\"příjmení a jméno\",$A9)),-1,GETPIVOTDATA(\"Bodů\",Knt!$A$3,\"příjmení a jméno\",$A9))","v":24},{"$f":"IF(ISERR(GETPIVOTDATA(\"Součet z RZB\",Knt!$A$3,\"příjmení a jméno\",$A9)),0,GETPIVOTDATA(\"Součet z RZB\",Knt!$A$3,\"příjmení a jméno\",$A9))","v":12},{"$f":"IF(ISERR(GETPIVOTDATA(\"Součet z PZB\",Knt!$A$3,\"příjmení a jméno\",$A9)),0,GETPIVOTDATA(\"Součet z PZB\",Knt!$A$3,\"příjmení a jméno\",$A9))","v":13}]
[{"$f":"IF(Knt!A14=\" \",0,Knt!A14)","v":"Valentík Tomáš"},{"$f":"IF(ISERR(GETPIVOTDATA(\"Bodů\",Knt!$A$3,\"příjmení a jméno\",$A10)),-1,GETPIVOTDATA(\"Bodů\",Knt!$A$3,\"příjmení a jméno\",$A10))","v":23},{"$f":"IF(ISERR(GETPIVOTDATA(\"Součet z RZB\",Knt!$A$3,\"příjmení a jméno\",$A10)),0,GETPIVOTDATA(\"Součet z RZB\",Knt!$A$3,\"příjmení a jméno\",$A10))","v":5},{"$f":"IF(ISERR(GETPIVOTDATA(\"Součet z PZB\",Knt!$A$3,\"příjmení a jméno\",$A10)),0,GETPIVOTDATA(\"Součet z PZB\",Knt!$A$3,\"příjmení a jméno\",$A10))","v":1.8333333333333333}]
[{"$f":"IF(Knt!A15=\" \",0,Knt!A15)","v":"Nováček Nikolas"},{"$f":"IF(ISERR(GETPIVOTDATA(\"Bodů\",Knt!$A$3,\"příjmení a jméno\",$A11)),-1,GETPIVOTDATA(\"Bodů\",Knt!$A$3,\"příjmení a jméno\",$A11))","v":21},{"$f":"IF(ISERR(GETPIVOTDATA(\"Součet z RZB\",Knt!$A$3,\"příjmení a jméno\",$A11)),0,GETPIVOTDATA(\"Součet z RZB\",Knt!$A$3,\"příjmení a jméno\",$A11))","v":10},{"$f":"IF(ISERR(GETPIVOTDATA(\"Součet z PZB\",Knt!$A$3,\"příjmení a jméno\",$A11)),0,GETPIVOTDATA(\"Součet z PZB\",Knt!$A$3,\"příjmení a jméno\",$A11))","v":11}]
[{"$f":"IF(Knt!A16=\" \",0,Knt!A16)","v":"Nuhlíček Michal"},{"$f":"IF(ISERR(GETPIVOTDATA(\"Bodů\",Knt!$A$3,\"příjmení a jméno\",$A12)),-1,GETPIVOTDATA(\"Bodů\",Knt!$A$3,\"příjmení a jméno\",$A12))","v":20},{"$f":"IF(ISERR(GETPIVOTDATA(\"Součet z RZB\",Knt!$A$3,\"příjmení a jméno\",$A12)),0,GETPIVOTDATA(\"Součet z RZB\",Knt!$A$3,\"příjmení a jméno\",$A12))","v":9},{"$f":"IF(ISERR(GETPIVOTDATA(\"Součet z PZB\",Knt!$A$3,\"příjmení a jméno\",$A12)),0,GETPIVOTDATA(\"Součet z PZB\",Knt!$A$3,\"příjmení a jméno\",$A12))","v":4}]
[{"$f":"IF(Knt!A17=\" \",0,Knt!A17)","v":"Nuhlíček Jakub"},{"$f":"IF(ISERR(GETPIVOTDATA(\"Bodů\",Knt!$A$3,\"příjmení a jméno\",$A13)),-1,GETPIVOTDATA(\"Bodů\",Knt!$A$3,\"příjmení a jméno\",$A13))","v":20},{"$f":"IF(ISERR(GETPIVOTDATA(\"Součet z RZB\",Knt!$A$3,\"příjmení a jméno\",$A13)),0,GETPIVOTDATA(\"Součet z RZB\",Knt!$A$3,\"příjmení a jméno\",$A13))","v":3},{"$f":"IF(ISERR(GETPIVOTDATA(\"Součet z PZB\",Knt!$A$3,\"příjmení a jméno\",$A13)),0,GETPIVOTDATA(\"Součet z PZB\",Knt!$A$3,\"příjmení a jméno\",$A13))","v":1.3333333333333333}]
[{"$f":"IF(Knt!A18=\" \",0,Knt!A18)","v":"Bukovjanová Charlotte"},{"$f":"IF(ISERR(GETPIVOTDATA(\"Bodů\",Knt!$A$3,\"příjmení a jméno\",$A14)),-1,GETPIVOTDATA(\"Bodů\",Knt!$A$3,\"příjmení a jméno\",$A14))","v":20},{"$f":"IF(ISERR(GETPIVOTDATA(\"Součet z RZB\",Knt!$A$3,\"příjmení a jméno\",$A14)),0,GETPIVOTDATA(\"Součet z RZB\",Knt!$A$3,\"příjmení a jméno\",$A14))","v":2},{"$f":"IF(ISERR(GETPIVOTDATA(\"Součet z PZB\",Knt!$A$3,\"příjmení a jméno\",$A14)),0,GETPIVOTDATA(\"Součet z PZB\",Knt!$A$3,\"příjmení a jméno\",$A14))","v":1.2857142857142858}]
[{"$f":"IF(Knt!A19=\" \",0,Knt!A19)","v":"Šotola Kryštof"},{"$f":"IF(ISERR(GETPIVOTDATA(\"Bodů\",Knt!$A$3,\"příjmení a jméno\",$A15)),-1,GETPIVOTDATA(\"Bodů\",Knt!$A$3,\"příjmení a jméno\",$A15))","v":20},{"$f":"IF(ISERR(GETPIVOTDATA(\"Součet z RZB\",Knt!$A$3,\"příjmení a jméno\",$A15)),0,GETPIVOTDATA(\"Součet z RZB\",Knt!$A$3,\"příjmení a jméno\",$A15))","v":-20},{"$f":"IF(ISERR(GETPIVOTDATA(\"Součet z PZB\",Knt!$A$3,\"příjmení a jméno\",$A15)),0,GETPIVOTDATA(\"Součet z PZB\",Knt!$A$3,\"příjmení a jméno\",$A15))","v":0.31034482758620691}]
[{"$f":"IF(Knt!A20=\" \",0,Knt!A20)","v":"Boháč Adam"},{"$f":"IF(ISERR(GETPIVOTDATA(\"Bodů\",Knt!$A$3,\"příjmení a jméno\",$A16)),-1,GETPIVOTDATA(\"Bodů\",Knt!$A$3,\"příjmení a jméno\",$A16))","v":19},{"$f":"IF(ISERR(GETPIVOTDATA(\"Součet z RZB\",Knt!$A$3,\"příjmení a jméno\",$A16)),0,GETPIVOTDATA(\"Součet z RZB\",Knt!$A$3,\"příjmení a jméno\",$A16))","v":9},{"$f":"IF(ISERR(GETPIVOTDATA(\"Součet z PZB\",Knt!$A$3,\"příjmení a jméno\",$A16)),0,GETPIVOTDATA(\"Součet z PZB\",Knt!$A$3,\"příjmení a jméno\",$A16))","v":5.5}]
[{"$f":"IF(Knt!A22=\" \",0,Knt!A22)","v":"Suchan Jan"},{"$f":"IF(ISERR(GETPIVOTDATA(\"Bodů\",Knt!$A$3,\"příjmení a jméno\",$A17)),-1,GETPIVOTDATA(\"Bodů\",Knt!$A$3,\"příjmení a jméno\",$A17))","v":19},{"$f":"IF(ISERR(GETPIVOTDATA(\"Součet z RZB\",Knt!$A$3,\"příjmení a jméno\",$A17)),0,GETPIVOTDATA(\"Součet z RZB\",Knt!$A$3,\"příjmení a jméno\",$A17))","v":4},{"$f":"IF(ISERR(GETPIVOTDATA(\"Součet z PZB\",Knt!$A$3,\"příjmení a jméno\",$A17)),0,GETPIVOTDATA(\"Součet z PZB\",Knt!$A$3,\"příjmení a jméno\",$A17))","v":1.8}]
[{"$f":"IF(Knt!A21=\" \",0,Knt!A21)","v":"Stark Vojtěch"},{"$f":"IF(ISERR(GETPIVOTDATA(\"Bodů\",Knt!$A$3,\"příjmení a jméno\",$A18)),-1,GETPIVOTDATA(\"Bodů\",Knt!$A$3,\"příjmení a jméno\",$A18))","v":19},{"$f":"IF(ISERR(GETPIVOTDATA(\"Součet z RZB\",Knt!$A$3,\"příjmení a jméno\",$A18)),0,GETPIVOTDATA(\"Součet z RZB\",Knt!$A$3,\"příjmení a jméno\",$A18))","v":-5},{"$f":"IF(ISERR(GETPIVOTDATA(\"Součet z PZB\",Knt!$A$3,\"příjmení a jméno\",$A18)),0,GETPIVOTDATA(\"Součet z PZB\",Knt!$A$3,\"příjmení a jméno\",$A18))","v":0.6428571428571429}]
[{"$f":"IF(Knt!A23=\" \",0,Knt!A23)","v":"Čech Jiří"},{"$f":"IF(ISERR(GETPIVOTDATA(\"Bodů\",Knt!$A$3,\"příjmení a jméno\",$A19)),-1,GETPIVOTDATA(\"Bodů\",Knt!$A$3,\"příjmení a jméno\",$A19))","v":18},{"$f":"IF(ISERR(GETPIVOTDATA(\"Součet z RZB\",Knt!$A$3,\"příjmení a jméno\",$A19)),0,GETPIVOTDATA(\"Součet z RZB\",Knt!$A$3,\"příjmení a jméno\",$A19))","v":6},{"$f":"IF(ISERR(GETPIVOTDATA(\"Součet z PZB\",Knt!$A$3,\"příjmení a jméno\",$A19)),0,GETPIVOTDATA(\"Součet z PZB\",Knt!$A$3,\"příjmení a jméno\",$A19))","v":3}]
[{"$f":"IF(Knt!A25=\" \",0,Knt!A25)","v":"Ďuriš Vojtěch"},{"$f":"IF(ISERR(GETPIVOTDATA(\"Bodů\",Knt!$A$3,\"příjmení a jméno\",$A20)),-1,GETPIVOTDATA(\"Bodů\",Knt!$A$3,\"příjmení a jméno\",$A20))","v":17},{"$f":"IF(ISERR(GETPIVOTDATA(\"Součet z RZB\",Knt!$A$3,\"příjmení a jméno\",$A20)),0,GETPIVOTDATA(\"Součet z RZB\",Knt!$A$3,\"příjmení a jméno\",$A20))","v":8},{"$f":"IF(ISERR(GETPIVOTDATA(\"Součet z PZB\",Knt!$A$3,\"příjmení a jméno\",$A20)),0,GETPIVOTDATA(\"Součet z PZB\",Knt!$A$3,\"příjmení a jméno\",$A20))","v":0}]
[{"$f":"IF(Knt!A24=\" \",0,Knt!A24)","v":"Ryška Filip"},{"$f":"IF(ISERR(GETPIVOTDATA(\"Bodů\",Knt!$A$3,\"příjmení a jméno\",$A21)),-1,GETPIVOTDATA(\"Bodů\",Knt!$A$3,\"příjmení a jméno\",$A21))","v":17},{"$f":"IF(ISERR(GETPIVOTDATA(\"Součet z RZB\",Knt!$A$3,\"příjmení a jméno\",$A21)),0,GETPIVOTDATA(\"Součet z RZB\",Knt!$A$3,\"příjmení a jméno\",$A21))","v":2},{"$f":"IF(ISERR(GETPIVOTDATA(\"Součet z PZB\",Knt!$A$3,\"příjmení a jméno\",$A21)),0,GETPIVOTDATA(\"Součet z PZB\",Knt!$A$3,\"příjmení a jméno\",$A21))","v":1.2857142857142858}]
[{"$f":"IF(Knt!A28=\" \",0,Knt!A28)","v":"Jakšík Daniel"},{"$f":"IF(ISERR(GETPIVOTDATA(\"Bodů\",Knt!$A$3,\"příjmení a jméno\",$A22)),-1,GETPIVOTDATA(\"Bodů\",Knt!$A$3,\"příjmení a jméno\",$A22))","v":16},{"$f":"IF(ISERR(GETPIVOTDATA(\"Součet z RZB\",Knt!$A$3,\"příjmení a jméno\",$A22)),0,GETPIVOTDATA(\"Součet z RZB\",Knt!$A$3,\"příjmení a jméno\",$A22))","v":7},{"$f":"IF(ISERR(GETPIVOTDATA(\"Součet z PZB\",Knt!$A$3,\"příjmení a jméno\",$A22)),0,GETPIVOTDATA(\"Součet z PZB\",Knt!$A$3,\"příjmení a jméno\",$A22))","v":8}]
[{"$f":"IF(Knt!A27=\" \",0,Knt!A27)","v":"Turek Jakub"},{"$f":"IF(ISERR(GETPIVOTDATA(\"Bodů\",Knt!$A$3,\"příjmení a jméno\",$A23)),-1,GETPIVOTDATA(\"Bodů\",Knt!$A$3,\"příjmení a jméno\",$A23))","v":16},{"$f":"IF(ISERR(GETPIVOTDATA(\"Součet z RZB\",Knt!$A$3,\"příjmení a jméno\",$A23)),0,GETPIVOTDATA(\"Součet z RZB\",Knt!$A$3,\"příjmení a jméno\",$A23))","v":4},{"$f":"IF(ISERR(GETPIVOTDATA(\"Součet z PZB\",Knt!$A$3,\"příjmení a jméno\",$A23)),0,GETPIVOTDATA(\"Součet z PZB\",Knt!$A$3,\"příjmení a jméno\",$A23))","v":1.8}]
[{"$f":"IF(Knt!A26=\" \",0,Knt!A26)","v":"Benáčková Denisa"},{"$f":"IF(ISERR(GETPIVOTDATA(\"Bodů\",Knt!$A$3,\"příjmení a jméno\",$A24)),-1,GETPIVOTDATA(\"Bodů\",Knt!$A$3,\"příjmení a jméno\",$A24))","v":16},{"$f":"IF(ISERR(GETPIVOTDATA(\"Součet z RZB\",Knt!$A$3,\"příjmení a jméno\",$A24)),0,GETPIVOTDATA(\"Součet z RZB\",Knt!$A$3,\"příjmení a jméno\",$A24))","v":-3},{"$f":"IF(ISERR(GETPIVOTDATA(\"Součet z PZB\",Knt!$A$3,\"příjmení a jméno\",$A24)),0,GETPIVOTDATA(\"Součet z PZB\",Knt!$A$3,\"příjmení a jméno\",$A24))","v":0.66666666666666663}]
[{"$f":"IF(Knt!A34=\" \",0,Knt!A34)","v":"Rapčanová Silvie"},{"$f":"IF(ISERR(GETPIVOTDATA(\"Bodů\",Knt!$A$3,\"příjmení a jméno\",$A25)),-1,GETPIVOTDATA(\"Bodů\",Knt!$A$3,\"příjmení a jméno\",$A25))","v":15},{"$f":"IF(ISERR(GETPIVOTDATA(\"Součet z RZB\",Knt!$A$3,\"příjmení a jméno\",$A25)),0,GETPIVOTDATA(\"Součet z RZB\",Knt!$A$3,\"příjmení a jméno\",$A25))","v":7},{"$f":"IF(ISERR(GETPIVOTDATA(\"Součet z PZB\",Knt!$A$3,\"příjmení a jméno\",$A25)),0,GETPIVOTDATA(\"Součet z PZB\",Knt!$A$3,\"příjmení a jméno\",$A25))","v":8}]
[{"$f":"IF(Knt!A31=\" \",0,Knt!A31)","v":"Novotný Kryštof"},{"$f":"IF(ISERR(GETPIVOTDATA(\"Bodů\",Knt!$A$3,\"příjmení a jméno\",$A26)),-1,GETPIVOTDATA(\"Bodů\",Knt!$A$3,\"příjmení a jméno\",$A26))","v":15},{"$f":"IF(ISERR(GETPIVOTDATA(\"Součet z RZB\",Knt!$A$3,\"příjmení a jméno\",$A26)),0,GETPIVOTDATA(\"Součet z RZB\",Knt!$A$3,\"příjmení a jméno\",$A26))","v":7},{"$f":"IF(ISERR(GETPIVOTDATA(\"Součet z PZB\",Knt!$A$3,\"příjmení a jméno\",$A26)),0,GETPIVOTDATA(\"Součet z PZB\",Knt!$A$3,\"příjmení a jméno\",$A26))","v":8}]
[{"$f":"IF(Knt!A30=\" \",0,Knt!A30)","v":"Mec Tobias"},{"$f":"IF(ISERR(GETPIVOTDATA(\"Bodů\",Knt!$A$3,\"příjmení a jméno\",$A27)),-1,GETPIVOTDATA(\"Bodů\",Knt!$A$3,\"příjmení a jméno\",$A27))","v":15},{"$f":"IF(ISERR(GETPIVOTDATA(\"Součet z RZB\",Knt!$A$3,\"příjmení a jméno\",$A27)),0,GETPIVOTDATA(\"Součet z RZB\",Knt!$A$3,\"příjmení a jméno\",$A27))","v":7},{"$f":"IF(ISERR(GETPIVOTDATA(\"Součet z PZB\",Knt!$A$3,\"příjmení a jméno\",$A27)),0,GETPIVOTDATA(\"Součet z PZB\",Knt!$A$3,\"příjmení a jméno\",$A27))","v":4.5}]
[{"$f":"IF(Knt!A29=\" \",0,Knt!A29)","v":"Huvar Matyáš"},{"$f":"IF(ISERR(GETPIVOTDATA(\"Bodů\",Knt!$A$3,\"příjmení a jméno\",$A28)),-1,GETPIVOTDATA(\"Bodů\",Knt!$A$3,\"příjmení a jméno\",$A28))","v":15},{"$f":"IF(ISERR(GETPIVOTDATA(\"Součet z RZB\",Knt!$A$3,\"příjmení a jméno\",$A28)),0,GETPIVOTDATA(\"Součet z RZB\",Knt!$A$3,\"příjmení a jméno\",$A28))","v":6},{"$f":"IF(ISERR(GETPIVOTDATA(\"Součet z PZB\",Knt!$A$3,\"příjmení a jméno\",$A28)),0,GETPIVOTDATA(\"Součet z PZB\",Knt!$A$3,\"příjmení a jméno\",$A28))","v":7}]
[{"$f":"IF(Knt!A33=\" \",0,Knt!A33)","v":"Kožušník Václav"},{"$f":"IF(ISERR(GETPIVOTDATA(\"Bodů\",Knt!$A$3,\"příjmení a jméno\",$A29)),-1,GETPIVOTDATA(\"Bodů\",Knt!$A$3,\"příjmení a jméno\",$A29))","v":15},{"$f":"IF(ISERR(GETPIVOTDATA(\"Součet z RZB\",Knt!$A$3,\"příjmení a jméno\",$A29)),0,GETPIVOTDATA(\"Součet z RZB\",Knt!$A$3,\"příjmení a jméno\",$A29))","v":4},{"$f":"IF(ISERR(GETPIVOTDATA(\"Součet z PZB\",Knt!$A$3,\"příjmení a jméno\",$A29)),0,GETPIVOTDATA(\"Součet z PZB\",Knt!$A$3,\"příjmení a jméno\",$A29))","v":2}]
[{"$f":"IF(Knt!A37=\" \",0,Knt!A37)","v":"Caletka Petr"},{"$f":"IF(ISERR(GETPIVOTDATA(\"Bodů\",Knt!$A$3,\"příjmení a jméno\",$A30)),-1,GETPIVOTDATA(\"Bodů\",Knt!$A$3,\"příjmení a jméno\",$A30))","v":15},{"$f":"IF(ISERR(GETPIVOTDATA(\"Součet z RZB\",Knt!$A$3,\"příjmení a jméno\",$A30)),0,GETPIVOTDATA(\"Součet z RZB\",Knt!$A$3,\"příjmení a jméno\",$A30))","v":4},{"$f":"IF(ISERR(GETPIVOTDATA(\"Součet z PZB\",Knt!$A$3,\"příjmení a jméno\",$A30)),0,GETPIVOTDATA(\"Součet z PZB\",Knt!$A$3,\"příjmení a jméno\",$A30))","v":2}]
[{"$f":"IF(Knt!A36=\" \",0,Knt!A36)","v":"Mička Tomáš"},{"$f":"IF(ISERR(GETPIVOTDATA(\"Bodů\",Knt!$A$3,\"příjmení a jméno\",$A31)),-1,GETPIVOTDATA(\"Bodů\",Knt!$A$3,\"příjmení a jméno\",$A31))","v":15},{"$f":"IF(ISERR(GETPIVOTDATA(\"Součet z RZB\",Knt!$A$3,\"příjmení a jméno\",$A31)),0,GETPIVOTDATA(\"Součet z RZB\",Knt!$A$3,\"příjmení a jméno\",$A31))","v":3},{"$f":"IF(ISERR(GETPIVOTDATA(\"Součet z PZB\",Knt!$A$3,\"příjmení a jméno\",$A31)),0,GETPIVOTDATA(\"Součet z PZB\",Knt!$A$3,\"příjmení a jméno\",$A31))","v":1.75}]
[{"$f":"IF(Knt!A35=\" \",0,Knt!A35)","v":"Brož Ondřej"},{"$f":"IF(ISERR(GETPIVOTDATA(\"Bodů\",Knt!$A$3,\"příjmení a jméno\",$A32)),-1,GETPIVOTDATA(\"Bodů\",Knt!$A$3,\"příjmení a jméno\",$A32))","v":15},{"$f":"IF(ISERR(GETPIVOTDATA(\"Součet z RZB\",Knt!$A$3,\"příjmení a jméno\",$A32)),0,GETPIVOTDATA(\"Součet z RZB\",Knt!$A$3,\"příjmení a jméno\",$A32))","v":2},{"$f":"IF(ISERR(GETPIVOTDATA(\"Součet z PZB\",Knt!$A$3,\"příjmení a jméno\",$A32)),0,GETPIVOTDATA(\"Součet z PZB\",Knt!$A$3,\"příjmení a jméno\",$A32))","v":1.4}]
[{"$f":"IF(Knt!A32=\" \",0,Knt!A32)","v":"Graňák Dominik"},{"$f":"IF(ISERR(GETPIVOTDATA(\"Bodů\",Knt!$A$3,\"příjmení a jméno\",$A33)),-1,GETPIVOTDATA(\"Bodů\",Knt!$A$3,\"příjmení a jméno\",$A33))","v":15},{"$f":"IF(ISERR(GETPIVOTDATA(\"Součet z RZB\",Knt!$A$3,\"příjmení a jméno\",$A33)),0,GETPIVOTDATA(\"Součet z RZB\",Knt!$A$3,\"příjmení a jméno\",$A33))","v":-8},{"$f":"IF(ISERR(GETPIVOTDATA(\"Součet z PZB\",Knt!$A$3,\"příjmení a jméno\",$A33)),0,GETPIVOTDATA(\"Součet z PZB\",Knt!$A$3,\"příjmení a jméno\",$A33))","v":0.5}]
[{"$f":"IF(Knt!A38=\" \",0,Knt!A38)","v":"Rapčanová Sylvie"},{"$f":"IF(ISERR(GETPIVOTDATA(\"Bodů\",Knt!$A$3,\"příjmení a jméno\",$A34)),-1,GETPIVOTDATA(\"Bodů\",Knt!$A$3,\"příjmení a jméno\",$A34))","v":14},{"$f":"IF(ISERR(GETPIVOTDATA(\"Součet z RZB\",Knt!$A$3,\"příjmení a jméno\",$A34)),0,GETPIVOTDATA(\"Součet z RZB\",Knt!$A$3,\"příjmení a jméno\",$A34))","v":5},{"$f":"IF(ISERR(GETPIVOTDATA(\"Součet z PZB\",Knt!$A$3,\"příjmení a jméno\",$A34)),0,GETPIVOTDATA(\"Součet z PZB\",Knt!$A$3,\"příjmení a jméno\",$A34))","v":6}]
[{"$f":"IF(Knt!A39=\" \",0,Knt!A39)","v":"Marný Jakub"},{"$f":"IF(ISERR(GETPIVOTDATA(\"Bodů\",Knt!$A$3,\"příjmení a jméno\",$A35)),-1,GETPIVOTDATA(\"Bodů\",Knt!$A$3,\"příjmení a jméno\",$A35))","v":14},{"$f":"IF(ISERR(GETPIVOTDATA(\"Součet z RZB\",Knt!$A$3,\"příjmení a jméno\",$A35)),0,GETPIVOTDATA(\"Součet z RZB\",Knt!$A$3,\"příjmení a jméno\",$A35))","v":5},{"$f":"IF(ISERR(GETPIVOTDATA(\"Součet z PZB\",Knt!$A$3,\"příjmení a jméno\",$A35)),0,GETPIVOTDATA(\"Součet z PZB\",Knt!$A$3,\"příjmení a jméno\",$A35))","v":0}]
[{"$f":"IF(Knt!A40=\" \",0,Knt!A40)","v":"Schotli Josef"},{"$f":"IF(ISERR(GETPIVOTDATA(\"Bodů\",Knt!$A$3,\"příjmení a jméno\",$A36)),-1,GETPIVOTDATA(\"Bodů\",Knt!$A$3,\"příjmení a jméno\",$A36))","v":14},{"$f":"IF(ISERR(GETPIVOTDATA(\"Součet z RZB\",Knt!$A$3,\"příjmení a jméno\",$A36)),0,GETPIVOTDATA(\"Součet z RZB\",Knt!$A$3,\"příjmení a jméno\",$A36))","v":1},{"$f":"IF(ISERR(GETPIVOTDATA(\"Součet z PZB\",Knt!$A$3,\"příjmení a jméno\",$A36)),0,GETPIVOTDATA(\"Součet z PZB\",Knt!$A$3,\"příjmení a jméno\",$A36))","v":1.1666666666666667}]
[{"$f":"IF(Knt!A45=\" \",0,Knt!A45)","v":"Neuwirt Petr"},{"$f":"IF(ISERR(GETPIVOTDATA(\"Bodů\",Knt!$A$3,\"příjmení a jméno\",$A37)),-1,GETPIVOTDATA(\"Bodů\",Knt!$A$3,\"příjmení a jméno\",$A37))","v":13},{"$f":"IF(ISERR(GETPIVOTDATA(\"Součet z RZB\",Knt!$A$3,\"příjmení a jméno\",$A37)),0,GETPIVOTDATA(\"Součet z RZB\",Knt!$A$3,\"příjmení a jméno\",$A37))","v":7},{"$f":"IF(ISERR(GETPIVOTDATA(\"Součet z PZB\",Knt!$A$3,\"příjmení a jméno\",$A37)),0,GETPIVOTDATA(\"Součet z PZB\",Knt!$A$3,\"příjmení a jméno\",$A37))","v":0}]
[{"$f":"IF(Knt!A42=\" \",0,Knt!A42)","v":"Salamonová Karolína"},{"$f":"IF(ISERR(GETPIVOTDATA(\"Bodů\",Knt!$A$3,\"příjmení a jméno\",$A38)),-1,GETPIVOTDATA(\"Bodů\",Knt!$A$3,\"příjmení a jméno\",$A38))","v":13},{"$f":"IF(ISERR(GETPIVOTDATA(\"Součet z RZB\",Knt!$A$3,\"příjmení a jméno\",$A38)),0,GETPIVOTDATA(\"Součet z RZB\",Knt!$A$3,\"příjmení a jméno\",$A38))","v":4},{"$f":"IF(ISERR(GETPIVOTDATA(\"Součet z PZB\",Knt!$A$3,\"příjmení a jméno\",$A38)),0,GETPIVOTDATA(\"Součet z PZB\",Knt!$A$3,\"příjmení a jméno\",$A38))","v":3}]
[{"$f":"IF(Knt!A44=\" \",0,Knt!A44)","v":"Nováček Nicolas"},{"$f":"IF(ISERR(GETPIVOTDATA(\"Bodů\",Knt!$A$3,\"příjmení a jméno\",$A39)),-1,GETPIVOTDATA(\"Bodů\",Knt!$A$3,\"příjmení a jméno\",$A39))","v":13},{"$f":"IF(ISERR(GETPIVOTDATA(\"Součet z RZB\",Knt!$A$3,\"příjmení a jméno\",$A39)),0,GETPIVOTDATA(\"Součet z RZB\",Knt!$A$3,\"příjmení a jméno\",$A39))","v":4},{"$f":"IF(ISERR(GETPIVOTDATA(\"Součet z PZB\",Knt!$A$3,\"příjmení a jméno\",$A39)),0,GETPIVOTDATA(\"Součet z PZB\",Knt!$A$3,\"příjmení a jméno\",$A39))","v":3}]
[{"$f":"IF(Knt!A41=\" \",0,Knt!A41)","v":"Papavasilevský Marek"},{"$f":"IF(ISERR(GETPIVOTDATA(\"Bodů\",Knt!$A$3,\"příjmení a jméno\",$A40)),-1,GETPIVOTDATA(\"Bodů\",Knt!$A$3,\"příjmení a jméno\",$A40))","v":13},{"$f":"IF(ISERR(GETPIVOTDATA(\"Součet z RZB\",Knt!$A$3,\"příjmení a jméno\",$A40)),0,GETPIVOTDATA(\"Součet z RZB\",Knt!$A$3,\"příjmení a jméno\",$A40))","v":4},{"$f":"IF(ISERR(GETPIVOTDATA(\"Součet z PZB\",Knt!$A$3,\"příjmení a jméno\",$A40)),0,GETPIVOTDATA(\"Součet z PZB\",Knt!$A$3,\"příjmení a jméno\",$A40))","v":2.3333333333333335}]
[{"$f":"IF(Knt!A43=\" \",0,Knt!A43)","v":"Marvan Lukáš"},{"$f":"IF(ISERR(GETPIVOTDATA(\"Bodů\",Knt!$A$3,\"příjmení a jméno\",$A41)),-1,GETPIVOTDATA(\"Bodů\",Knt!$A$3,\"příjmení a jméno\",$A41))","v":13},{"$f":"IF(ISERR(GETPIVOTDATA(\"Součet z RZB\",Knt!$A$3,\"příjmení a jméno\",$A41)),0,GETPIVOTDATA(\"Součet z RZB\",Knt!$A$3,\"příjmení a jméno\",$A41))","v":3},{"$f":"IF(ISERR(GETPIVOTDATA(\"Součet z PZB\",Knt!$A$3,\"příjmení a jméno\",$A41)),0,GETPIVOTDATA(\"Součet z PZB\",Knt!$A$3,\"příjmení a jméno\",$A41))","v":1.75}]
[{"$f":"IF(Knt!A46=\" \",0,Knt!A46)","v":"Martinásek Šimon"},{"$f":"IF(ISERR(GETPIVOTDATA(\"Bodů\",Knt!$A$3,\"příjmení a jméno\",$A42)),-1,GETPIVOTDATA(\"Bodů\",Knt!$A$3,\"příjmení a jméno\",$A42))","v":13},{"$f":"IF(ISERR(GETPIVOTDATA(\"Součet z RZB\",Knt!$A$3,\"příjmení a jméno\",$A42)),0,GETPIVOTDATA(\"Součet z RZB\",Knt!$A$3,\"příjmení a jméno\",$A42))","v":0},{"$f":"IF(ISERR(GETPIVOTDATA(\"Součet z PZB\",Knt!$A$3,\"příjmení a jméno\",$A42)),0,GETPIVOTDATA(\"Součet z PZB\",Knt!$A$3,\"příjmení a jméno\",$A42))","v":1}]
[{"$f":"IF(Knt!A47=\" \",0,Knt!A47)","v":"Neckář Matěj"},{"$f":"IF(ISERR(GETPIVOTDATA(\"Bodů\",Knt!$A$3,\"příjmení a jméno\",$A43)),-1,GETPIVOTDATA(\"Bodů\",Knt!$A$3,\"příjmení a jméno\",$A43))","v":12},{"$f":"IF(ISERR(GETPIVOTDATA(\"Součet z RZB\",Knt!$A$3,\"příjmení a jméno\",$A43)),0,GETPIVOTDATA(\"Součet z RZB\",Knt!$A$3,\"příjmení a jméno\",$A43))","v":6},{"$f":"IF(ISERR(GETPIVOTDATA(\"Součet z PZB\",Knt!$A$3,\"příjmení a jméno\",$A43)),0,GETPIVOTDATA(\"Součet z PZB\",Knt!$A$3,\"příjmení a jméno\",$A43))","v":7}]
[{"$f":"IF(Knt!A49=\" \",0,Knt!A49)","v":"Doubek Benjamin"},{"$f":"IF(ISERR(GETPIVOTDATA(\"Bodů\",Knt!$A$3,\"příjmení a jméno\",$A44)),-1,GETPIVOTDATA(\"Bodů\",Knt!$A$3,\"příjmení a jméno\",$A44))","v":12},{"$f":"IF(ISERR(GETPIVOTDATA(\"Součet z RZB\",Knt!$A$3,\"příjmení a jméno\",$A44)),0,GETPIVOTDATA(\"Součet z RZB\",Knt!$A$3,\"příjmení a jméno\",$A44))","v":4},{"$f":"IF(ISERR(GETPIVOTDATA(\"Součet z PZB\",Knt!$A$3,\"příjmení a jméno\",$A44)),0,GETPIVOTDATA(\"Součet z PZB\",Knt!$A$3,\"příjmení a jméno\",$A44))","v":3}]
[{"$f":"IF(Knt!A50=\" \",0,Knt!A50)","v":"Leone Luca"},{"$f":"IF(ISERR(GETPIVOTDATA(\"Bodů\",Knt!$A$3,\"příjmení a jméno\",$A45)),-1,GETPIVOTDATA(\"Bodů\",Knt!$A$3,\"příjmení a jméno\",$A45))","v":12},{"$f":"IF(ISERR(GETPIVOTDATA(\"Součet z RZB\",Knt!$A$3,\"příjmení a jméno\",$A45)),0,GETPIVOTDATA(\"Součet z RZB\",Knt!$A$3,\"příjmení a jméno\",$A45))","v":3},{"$f":"IF(ISERR(GETPIVOTDATA(\"Součet z PZB\",Knt!$A$3,\"příjmení a jméno\",$A45)),0,GETPIVOTDATA(\"Součet z PZB\",Knt!$A$3,\"příjmení a jméno\",$A45))","v":1.75}]
[{"$f":"IF(Knt!A48=\" \",0,Knt!A48)","v":"Káňová Barbora"},{"$f":"IF(ISERR(GETPIVOTDATA(\"Bodů\",Knt!$A$3,\"příjmení a jméno\",$A46)),-1,GETPIVOTDATA(\"Bodů\",Knt!$A$3,\"příjmení a jméno\",$A46))","v":12},{"$f":"IF(ISERR(GETPIVOTDATA(\"Součet z RZB\",Knt!$A$3,\"příjmení a jméno\",$A46)),0,GETPIVOTDATA(\"Součet z RZB\",Knt!$A$3,\"příjmení a jméno\",$A46))","v":-1},{"$f":"IF(ISERR(GETPIVOTDATA(\"Součet z PZB\",Knt!$A$3,\"příjmení a jméno\",$A46)),0,GETPIVOTDATA(\"Součet z PZB\",Knt!$A$3,\"příjmení a jméno\",$A46))","v":0.8571428571428571}]
[{"$f":"IF(Knt!A59=\" \",0,Knt!A59)","v":"Křenek Jakub"},{"$f":"IF(ISERR(GETPIVOTDATA(\"Bodů\",Knt!$A$3,\"příjmení a jméno\",$A47)),-1,GETPIVOTDATA(\"Bodů\",Knt!$A$3,\"příjmení a jméno\",$A47))","v":11},{"$f":"IF(ISERR(GETPIVOTDATA(\"Součet z RZB\",Knt!$A$3,\"příjmení a jméno\",$A47)),0,GETPIVOTDATA(\"Součet z RZB\",Knt!$A$3,\"příjmení a jméno\",$A47))","v":5},{"$f":"IF(ISERR(GETPIVOTDATA(\"Součet z PZB\",Knt!$A$3,\"příjmení a jméno\",$A47)),0,GETPIVOTDATA(\"Součet z PZB\",Knt!$A$3,\"příjmení a jméno\",$A47))","v":6}]
[{"$f":"IF(Knt!A58=\" \",0,Knt!A58)","v":"Končítek Kryštof"},{"$f":"IF(ISERR(GETPIVOTDATA(\"Bodů\",Knt!$A$3,\"příjmení a jméno\",$A48)),-1,GETPIVOTDATA(\"Bodů\",Knt!$A$3,\"příjmení a jméno\",$A48))","v":11},{"$f":"IF(ISERR(GETPIVOTDATA(\"Součet z RZB\",Knt!$A$3,\"příjmení a jméno\",$A48)),0,GETPIVOTDATA(\"Součet z RZB\",Knt!$A$3,\"příjmení a jméno\",$A48))","v":5},{"$f":"IF(ISERR(GETPIVOTDATA(\"Součet z PZB\",Knt!$A$3,\"příjmení a jméno\",$A48)),0,GETPIVOTDATA(\"Součet z PZB\",Knt!$A$3,\"příjmení a jméno\",$A48))","v":6}]
[{"$f":"IF(Knt!A51=\" \",0,Knt!A51)","v":"Vavřina Viktor"},{"$f":"IF(ISERR(GETPIVOTDATA(\"Bodů\",Knt!$A$3,\"příjmení a jméno\",$A49)),-1,GETPIVOTDATA(\"Bodů\",Knt!$A$3,\"příjmení a jméno\",$A49))","v":11},{"$f":"IF(ISERR(GETPIVOTDATA(\"Součet z RZB\",Knt!$A$3,\"příjmení a jméno\",$A49)),0,GETPIVOTDATA(\"Součet z RZB\",Knt!$A$3,\"příjmení a jméno\",$A49))","v":5},{"$f":"IF(ISERR(GETPIVOTDATA(\"Součet z PZB\",Knt!$A$3,\"příjmení a jméno\",$A49)),0,GETPIVOTDATA(\"Součet z PZB\",Knt!$A$3,\"příjmení a jméno\",$A49))","v":0}]
[{"$f":"IF(Knt!A53=\" \",0,Knt!A53)","v":"Kaszperová Kristýna"},{"$f":"IF(ISERR(GETPIVOTDATA(\"Bodů\",Knt!$A$3,\"příjmení a jméno\",$A50)),-1,GETPIVOTDATA(\"Bodů\",Knt!$A$3,\"příjmení a jméno\",$A50))","v":11},{"$f":"IF(ISERR(GETPIVOTDATA(\"Součet z RZB\",Knt!$A$3,\"příjmení a jméno\",$A50)),0,GETPIVOTDATA(\"Součet z RZB\",Knt!$A$3,\"příjmení a jméno\",$A50))","v":5},{"$f":"IF(ISERR(GETPIVOTDATA(\"Součet z PZB\",Knt!$A$3,\"příjmení a jméno\",$A50)),0,GETPIVOTDATA(\"Součet z PZB\",Knt!$A$3,\"příjmení a jméno\",$A50))","v":0}]
[{"$f":"IF(Knt!A57=\" \",0,Knt!A57)","v":"Černý Michal"},{"$f":"IF(ISERR(GETPIVOTDATA(\"Bodů\",Knt!$A$3,\"příjmení a jméno\",$A51)),-1,GETPIVOTDATA(\"Bodů\",Knt!$A$3,\"příjmení a jméno\",$A51))","v":11},{"$f":"IF(ISERR(GETPIVOTDATA(\"Součet z RZB\",Knt!$A$3,\"příjmení a jméno\",$A51)),0,GETPIVOTDATA(\"Součet z RZB\",Knt!$A$3,\"příjmení a jméno\",$A51))","v":5},{"$f":"IF(ISERR(GETPIVOTDATA(\"Součet z PZB\",Knt!$A$3,\"příjmení a jméno\",$A51)),0,GETPIVOTDATA(\"Součet z PZB\",Knt!$A$3,\"příjmení a jméno\",$A51))","v":0}]
[{"$f":"IF(Knt!A55=\" \",0,Knt!A55)","v":"Krischke Fabian"},{"$f":"IF(ISERR(GETPIVOTDATA(\"Bodů\",Knt!$A$3,\"příjmení a jméno\",$A52)),-1,GETPIVOTDATA(\"Bodů\",Knt!$A$3,\"příjmení a jméno\",$A52))","v":11},{"$f":"IF(ISERR(GETPIVOTDATA(\"Součet z RZB\",Knt!$A$3,\"příjmení a jméno\",$A52)),0,GETPIVOTDATA(\"Součet z RZB\",Knt!$A$3,\"příjmení a jméno\",$A52))","v":2},{"$f":"IF(ISERR(GETPIVOTDATA(\"Součet z PZB\",Knt!$A$3,\"příjmení a jméno\",$A52)),0,GETPIVOTDATA(\"Součet z PZB\",Knt!$A$3,\"příjmení a jméno\",$A52))","v":1.6666666666666667}]
[{"$f":"IF(Knt!A52=\" \",0,Knt!A52)","v":"Bencúr Eliáš"},{"$f":"IF(ISERR(GETPIVOTDATA(\"Bodů\",Knt!$A$3,\"příjmení a jméno\",$A53)),-1,GETPIVOTDATA(\"Bodů\",Knt!$A$3,\"příjmení a jméno\",$A53))","v":11},{"$f":"IF(ISERR(GETPIVOTDATA(\"Součet z RZB\",Knt!$A$3,\"příjmení a jméno\",$A53)),0,GETPIVOTDATA(\"Součet z RZB\",Knt!$A$3,\"příjmení a jméno\",$A53))","v":2},{"$f":"IF(ISERR(GETPIVOTDATA(\"Součet z PZB\",Knt!$A$3,\"příjmení a jméno\",$A53)),0,GETPIVOTDATA(\"Součet z PZB\",Knt!$A$3,\"příjmení a jméno\",$A53))","v":1.5}]
[{"$f":"IF(Knt!A56=\" \",0,Knt!A56)","v":"Filipiak Adam"},{"$f":"IF(ISERR(GETPIVOTDATA(\"Bodů\",Knt!$A$3,\"příjmení a jméno\",$A54)),-1,GETPIVOTDATA(\"Bodů\",Knt!$A$3,\"příjmení a jméno\",$A54))","v":11},{"$f":"IF(ISERR(GETPIVOTDATA(\"Součet z RZB\",Knt!$A$3,\"příjmení a jméno\",$A54)),0,GETPIVOTDATA(\"Součet z RZB\",Knt!$A$3,\"příjmení a jméno\",$A54))","v":0},{"$f":"IF(ISERR(GETPIVOTDATA(\"Součet z PZB\",Knt!$A$3,\"příjmení a jméno\",$A54)),0,GETPIVOTDATA(\"Součet z PZB\",Knt!$A$3,\"příjmení a jméno\",$A54))","v":1}]
[{"$f":"IF(Knt!A54=\" \",0,Knt!A54)","v":"Mikenda Ondřej"},{"$f":"IF(ISERR(GETPIVOTDATA(\"Bodů\",Knt!$A$3,\"příjmení a jméno\",$A55)),-1,GETPIVOTDATA(\"Bodů\",Knt!$A$3,\"příjmení a jméno\",$A55))","v":11},{"$f":"IF(ISERR(GETPIVOTDATA(\"Součet z RZB\",Knt!$A$3,\"příjmení a jméno\",$A55)),0,GETPIVOTDATA(\"Součet z RZB\",Knt!$A$3,\"příjmení a jméno\",$A55))","v":-5},{"$f":"IF(ISERR(GETPIVOTDATA(\"Součet z PZB\",Knt!$A$3,\"příjmení a jméno\",$A55)),0,GETPIVOTDATA(\"Součet z PZB\",Knt!$A$3,\"příjmení a jméno\",$A55))","v":0.44444444444444442}]
[{"$f":"IF(Knt!A63=\" \",0,Knt!A63)","v":"Řeha Daniel"},{"$f":"IF(ISERR(GETPIVOTDATA(\"Bodů\",Knt!$A$3,\"příjmení a jméno\",$A56)),-1,GETPIVOTDATA(\"Bodů\",Knt!$A$3,\"příjmení a jméno\",$A56))","v":10},{"$f":"IF(ISERR(GETPIVOTDATA(\"Součet z RZB\",Knt!$A$3,\"příjmení a jméno\",$A56)),0,GETPIVOTDATA(\"Součet z RZB\",Knt!$A$3,\"příjmení a jméno\",$A56))","v":5},{"$f":"IF(ISERR(GETPIVOTDATA(\"Součet z PZB\",Knt!$A$3,\"příjmení a jméno\",$A56)),0,GETPIVOTDATA(\"Součet z PZB\",Knt!$A$3,\"příjmení a jméno\",$A56))","v":0}]
[{"$f":"IF(Knt!A62=\" \",0,Knt!A62)","v":"Dvorský Denis"},{"$f":"IF(ISERR(GETPIVOTDATA(\"Bodů\",Knt!$A$3,\"příjmení a jméno\",$A57)),-1,GETPIVOTDATA(\"Bodů\",Knt!$A$3,\"příjmení a jméno\",$A57))","v":10},{"$f":"IF(ISERR(GETPIVOTDATA(\"Součet z RZB\",Knt!$A$3,\"příjmení a jméno\",$A57)),0,GETPIVOTDATA(\"Součet z RZB\",Knt!$A$3,\"příjmení a jméno\",$A57))","v":4},{"$f":"IF(ISERR(GETPIVOTDATA(\"Součet z PZB\",Knt!$A$3,\"příjmení a jméno\",$A57)),0,GETPIVOTDATA(\"Součet z PZB\",Knt!$A$3,\"příjmení a jméno\",$A57))","v":5}]
[{"$f":"IF(Knt!A60=\" \",0,Knt!A60)","v":"Vavřinová Pavla"},{"$f":"IF(ISERR(GETPIVOTDATA(\"Bodů\",Knt!$A$3,\"příjmení a jméno\",$A58)),-1,GETPIVOTDATA(\"Bodů\",Knt!$A$3,\"příjmení a jméno\",$A58))","v":10},{"$f":"IF(ISERR(GETPIVOTDATA(\"Součet z RZB\",Knt!$A$3,\"příjmení a jméno\",$A58)),0,GETPIVOTDATA(\"Součet z RZB\",Knt!$A$3,\"příjmení a jméno\",$A58))","v":4},{"$f":"IF(ISERR(GETPIVOTDATA(\"Součet z PZB\",Knt!$A$3,\"příjmení a jméno\",$A58)),0,GETPIVOTDATA(\"Součet z PZB\",Knt!$A$3,\"příjmení a jméno\",$A58))","v":5}]
[{"$f":"IF(Knt!A61=\" \",0,Knt!A61)","v":"Kapias Oliver"},{"$f":"IF(ISERR(GETPIVOTDATA(\"Bodů\",Knt!$A$3,\"příjmení a jméno\",$A59)),-1,GETPIVOTDATA(\"Bodů\",Knt!$A$3,\"příjmení a jméno\",$A59))","v":10},{"$f":"IF(ISERR(GETPIVOTDATA(\"Součet z RZB\",Knt!$A$3,\"příjmení a jméno\",$A59)),0,GETPIVOTDATA(\"Součet z RZB\",Knt!$A$3,\"příjmení a jméno\",$A59))","v":4},{"$f":"IF(ISERR(GETPIVOTDATA(\"Součet z PZB\",Knt!$A$3,\"příjmení a jméno\",$A59)),0,GETPIVOTDATA(\"Součet z PZB\",Knt!$A$3,\"příjmení a jméno\",$A59))","v":3}]
[{"$f":"IF(Knt!A64=\" \",0,Knt!A64)","v":"Vjaclovský David"},{"$f":"IF(ISERR(GETPIVOTDATA(\"Bodů\",Knt!$A$3,\"příjmení a jméno\",$A60)),-1,GETPIVOTDATA(\"Bodů\",Knt!$A$3,\"příjmení a jméno\",$A60))","v":10},{"$f":"IF(ISERR(GETPIVOTDATA(\"Součet z RZB\",Knt!$A$3,\"příjmení a jméno\",$A60)),0,GETPIVOTDATA(\"Součet z RZB\",Knt!$A$3,\"příjmení a jméno\",$A60))","v":-2},{"$f":"IF(ISERR(GETPIVOTDATA(\"Součet z PZB\",Knt!$A$3,\"příjmení a jméno\",$A60)),0,GETPIVOTDATA(\"Součet z PZB\",Knt!$A$3,\"příjmení a jméno\",$A60))","v":0.75}]
[{"$f":"IF(Knt!A68=\" \",0,Knt!A68)","v":"Halagačka Jiří"},{"$f":"IF(ISERR(GETPIVOTDATA(\"Bodů\",Knt!$A$3,\"příjmení a jméno\",$A61)),-1,GETPIVOTDATA(\"Bodů\",Knt!$A$3,\"příjmení a jméno\",$A61))","v":9},{"$f":"IF(ISERR(GETPIVOTDATA(\"Součet z RZB\",Knt!$A$3,\"příjmení a jméno\",$A61)),0,GETPIVOTDATA(\"Součet z RZB\",Knt!$A$3,\"příjmení a jméno\",$A61))","v":3},{"$f":"IF(ISERR(GETPIVOTDATA(\"Součet z PZB\",Knt!$A$3,\"příjmení a jméno\",$A61)),0,GETPIVOTDATA(\"Součet z PZB\",Knt!$A$3,\"příjmení a jméno\",$A61))","v":4}]
[{"$f":"IF(Knt!A65=\" \",0,Knt!A65)","v":"Žurek Sebastián"},{"$f":"IF(ISERR(GETPIVOTDATA(\"Bodů\",Knt!$A$3,\"příjmení a jméno\",$A62)),-1,GETPIVOTDATA(\"Bodů\",Knt!$A$3,\"příjmení a jméno\",$A62))","v":9},{"$f":"IF(ISERR(GETPIVOTDATA(\"Součet z RZB\",Knt!$A$3,\"příjmení a jméno\",$A62)),0,GETPIVOTDATA(\"Součet z RZB\",Knt!$A$3,\"příjmení a jméno\",$A62))","v":3},{"$f":"IF(ISERR(GETPIVOTDATA(\"Součet z PZB\",Knt!$A$3,\"příjmení a jméno\",$A62)),0,GETPIVOTDATA(\"Součet z PZB\",Knt!$A$3,\"příjmení a jméno\",$A62))","v":4}]
[{"$f":"IF(Knt!A69=\" \",0,Knt!A69)","v":"Hisem Matěj"},{"$f":"IF(ISERR(GETPIVOTDATA(\"Bodů\",Knt!$A$3,\"příjmení a jméno\",$A63)),-1,GETPIVOTDATA(\"Bodů\",Knt!$A$3,\"příjmení a jméno\",$A63))","v":9},{"$f":"IF(ISERR(GETPIVOTDATA(\"Součet z RZB\",Knt!$A$3,\"příjmení a jméno\",$A63)),0,GETPIVOTDATA(\"Součet z RZB\",Knt!$A$3,\"příjmení a jméno\",$A63))","v":3},{"$f":"IF(ISERR(GETPIVOTDATA(\"Součet z PZB\",Knt!$A$3,\"příjmení a jméno\",$A63)),0,GETPIVOTDATA(\"Součet z PZB\",Knt!$A$3,\"příjmení a jméno\",$A63))","v":2.5}]
[{"$f":"IF(Knt!A70=\" \",0,Knt!A70)","v":"Kolářová Valentýna"},{"$f":"IF(ISERR(GETPIVOTDATA(\"Bodů\",Knt!$A$3,\"příjmení a jméno\",$A64)),-1,GETPIVOTDATA(\"Bodů\",Knt!$A$3,\"příjmení a jméno\",$A64))","v":9},{"$f":"IF(ISERR(GETPIVOTDATA(\"Součet z RZB\",Knt!$A$3,\"příjmení a jméno\",$A64)),0,GETPIVOTDATA(\"Součet z RZB\",Knt!$A$3,\"příjmení a jméno\",$A64))","v":3},{"$f":"IF(ISERR(GETPIVOTDATA(\"Součet z PZB\",Knt!$A$3,\"příjmení a jméno\",$A64)),0,GETPIVOTDATA(\"Součet z PZB\",Knt!$A$3,\"příjmení a jméno\",$A64))","v":2.5}]
[{"$f":"IF(Knt!A71=\" \",0,Knt!A71)","v":"Kolář Vojtěch"},{"$f":"IF(ISERR(GETPIVOTDATA(\"Bodů\",Knt!$A$3,\"příjmení a jméno\",$A65)),-1,GETPIVOTDATA(\"Bodů\",Knt!$A$3,\"příjmení a jméno\",$A65))","v":9},{"$f":"IF(ISERR(GETPIVOTDATA(\"Součet z RZB\",Knt!$A$3,\"příjmení a jméno\",$A65)),0,GETPIVOTDATA(\"Součet z RZB\",Knt!$A$3,\"příjmení a jméno\",$A65))","v":3},{"$f":"IF(ISERR(GETPIVOTDATA(\"Součet z PZB\",Knt!$A$3,\"příjmení a jméno\",$A65)),0,GETPIVOTDATA(\"Součet z PZB\",Knt!$A$3,\"příjmení a jméno\",$A65))","v":2.5}]
[{"$f":"IF(Knt!A67=\" \",0,Knt!A67)","v":"Kulhánek Adam"},{"$f":"IF(ISERR(GETPIVOTDATA(\"Bodů\",Knt!$A$3,\"příjmení a jméno\",$A66)),-1,GETPIVOTDATA(\"Bodů\",Knt!$A$3,\"příjmení a jméno\",$A66))","v":9},{"$f":"IF(ISERR(GETPIVOTDATA(\"Součet z RZB\",Knt!$A$3,\"příjmení a jméno\",$A66)),0,GETPIVOTDATA(\"Součet z RZB\",Knt!$A$3,\"příjmení a jméno\",$A66))","v":2},{"$f":"IF(ISERR(GETPIVOTDATA(\"Součet z PZB\",Knt!$A$3,\"příjmení a jméno\",$A66)),0,GETPIVOTDATA(\"Součet z PZB\",Knt!$A$3,\"příjmení a jméno\",$A66))","v":2}]
[{"$f":"IF(Knt!A66=\" \",0,Knt!A66)","v":"King Samuel"},{"$f":"IF(ISERR(GETPIVOTDATA(\"Bodů\",Knt!$A$3,\"příjmení a jméno\",$A67)),-1,GETPIVOTDATA(\"Bodů\",Knt!$A$3,\"příjmení a jméno\",$A67))","v":9},{"$f":"IF(ISERR(GETPIVOTDATA(\"Součet z RZB\",Knt!$A$3,\"příjmení a jméno\",$A67)),0,GETPIVOTDATA(\"Součet z RZB\",Knt!$A$3,\"příjmení a jméno\",$A67))","v":0},{"$f":"IF(ISERR(GETPIVOTDATA(\"Součet z PZB\",Knt!$A$3,\"příjmení a jméno\",$A67)),0,GETPIVOTDATA(\"Součet z PZB\",Knt!$A$3,\"příjmení a jméno\",$A67))","v":1}]
[{"$f":"IF(Knt!A73=\" \",0,Knt!A73)","v":"Matějíčka Štěpán"},{"$f":"IF(ISERR(GETPIVOTDATA(\"Bodů\",Knt!$A$3,\"příjmení a jméno\",$A68)),-1,GETPIVOTDATA(\"Bodů\",Knt!$A$3,\"příjmení a jméno\",$A68))","v":8},{"$f":"IF(ISERR(GETPIVOTDATA(\"Součet z RZB\",Knt!$A$3,\"příjmení a jméno\",$A68)),0,GETPIVOTDATA(\"Součet z RZB\",Knt!$A$3,\"příjmení a jméno\",$A68))","v":2},{"$f":"IF(ISERR(GETPIVOTDATA(\"Součet z PZB\",Knt!$A$3,\"příjmení a jméno\",$A68)),0,GETPIVOTDATA(\"Součet z PZB\",Knt!$A$3,\"příjmení a jméno\",$A68))","v":3}]
[{"$f":"IF(Knt!A72=\" \",0,Knt!A72)","v":"Sněhota Matyáš"},{"$f":"IF(ISERR(GETPIVOTDATA(\"Bodů\",Knt!$A$3,\"příjmení a jméno\",$A69)),-1,GETPIVOTDATA(\"Bodů\",Knt!$A$3,\"příjmení a jméno\",$A69))","v":8},{"$f":"IF(ISERR(GETPIVOTDATA(\"Součet z RZB\",Knt!$A$3,\"příjmení a jméno\",$A69)),0,GETPIVOTDATA(\"Součet z RZB\",Knt!$A$3,\"příjmení a jméno\",$A69))","v":2},{"$f":"IF(ISERR(GETPIVOTDATA(\"Součet z PZB\",Knt!$A$3,\"příjmení a jméno\",$A69)),0,GETPIVOTDATA(\"Součet z PZB\",Knt!$A$3,\"příjmení a jméno\",$A69))","v":2}]
[{"$f":"IF(Knt!A74=\" \",0,Knt!A74)","v":"Wilkus Richard"},{"$f":"IF(ISERR(GETPIVOTDATA(\"Bodů\",Knt!$A$3,\"příjmení a jméno\",$A70)),-1,GETPIVOTDATA(\"Bodů\",Knt!$A$3,\"příjmení a jméno\",$A70))","v":8},{"$f":"IF(ISERR(GETPIVOTDATA(\"Součet z RZB\",Knt!$A$3,\"příjmení a jméno\",$A70)),0,GETPIVOTDATA(\"Součet z RZB\",Knt!$A$3,\"příjmení a jméno\",$A70))","v":-1},{"$f":"IF(ISERR(GETPIVOTDATA(\"Součet z PZB\",Knt!$A$3,\"příjmení a jméno\",$A70)),0,GETPIVOTDATA(\"Součet z PZB\",Knt!$A$3,\"příjmení a jméno\",$A70))","v":0.8}]
[{"$f":"IF(Knt!A80=\" \",0,Knt!A80)","v":"Siekiera Jakub"},{"$f":"IF(ISERR(GETPIVOTDATA(\"Bodů\",Knt!$A$3,\"příjmení a jméno\",$A71)),-1,GETPIVOTDATA(\"Bodů\",Knt!$A$3,\"příjmení a jméno\",$A71))","v":7},{"$f":"IF(ISERR(GETPIVOTDATA(\"Součet z RZB\",Knt!$A$3,\"příjmení a jméno\",$A71)),0,GETPIVOTDATA(\"Součet z RZB\",Knt!$A$3,\"příjmení a jméno\",$A71))","v":4},{"$f":"IF(ISERR(GETPIVOTDATA(\"Součet z PZB\",Knt!$A$3,\"příjmení a jméno\",$A71)),0,GETPIVOTDATA(\"Součet z PZB\",Knt!$A$3,\"příjmení a jméno\",$A71))","v":0}]
[{"$f":"IF(Knt!A83=\" \",0,Knt!A83)","v":"Líbenek Štěpán"},{"$f":"IF(ISERR(GETPIVOTDATA(\"Bodů\",Knt!$A$3,\"příjmení a jméno\",$A72)),-1,GETPIVOTDATA(\"Bodů\",Knt!$A$3,\"příjmení a jméno\",$A72))","v":7},{"$f":"IF(ISERR(GETPIVOTDATA(\"Součet z RZB\",Knt!$A$3,\"příjmení a jméno\",$A72)),0,GETPIVOTDATA(\"Součet z RZB\",Knt!$A$3,\"příjmení a jméno\",$A72))","v":4},{"$f":"IF(ISERR(GETPIVOTDATA(\"Součet z PZB\",Knt!$A$3,\"příjmení a jméno\",$A72)),0,GETPIVOTDATA(\"Součet z PZB\",Knt!$A$3,\"příjmení a jméno\",$A72))","v":0}]
[{"$f":"IF(Knt!A75=\" \",0,Knt!A75)","v":"Sedláček Jakub"},{"$f":"IF(ISERR(GETPIVOTDATA(\"Bodů\",Knt!$A$3,\"příjmení a jméno\",$A73)),-1,GETPIVOTDATA(\"Bodů\",Knt!$A$3,\"příjmení a jméno\",$A73))","v":7},{"$f":"IF(ISERR(GETPIVOTDATA(\"Součet z RZB\",Knt!$A$3,\"příjmení a jméno\",$A73)),0,GETPIVOTDATA(\"Součet z RZB\",Knt!$A$3,\"příjmení a jméno\",$A73))","v":4},{"$f":"IF(ISERR(GETPIVOTDATA(\"Součet z PZB\",Knt!$A$3,\"příjmení a jméno\",$A73)),0,GETPIVOTDATA(\"Součet z PZB\",Knt!$A$3,\"příjmení a jméno\",$A73))","v":0}]
[{"$f":"IF(Knt!A76=\" \",0,Knt!A76)","v":"Kopijas Oliver"},{"$f":"IF(ISERR(GETPIVOTDATA(\"Bodů\",Knt!$A$3,\"příjmení a jméno\",$A74)),-1,GETPIVOTDATA(\"Bodů\",Knt!$A$3,\"příjmení a jméno\",$A74))","v":7},{"$f":"IF(ISERR(GETPIVOTDATA(\"Součet z RZB\",Knt!$A$3,\"příjmení a jméno\",$A74)),0,GETPIVOTDATA(\"Součet z RZB\",Knt!$A$3,\"příjmení a jméno\",$A74))","v":4},{"$f":"IF(ISERR(GETPIVOTDATA(\"Součet z PZB\",Knt!$A$3,\"příjmení a jméno\",$A74)),0,GETPIVOTDATA(\"Součet z PZB\",Knt!$A$3,\"příjmení a jméno\",$A74))","v":0}]
[{"$f":"IF(Knt!A77=\" \",0,Knt!A77)","v":"Choleva Martin"},{"$f":"IF(ISERR(GETPIVOTDATA(\"Bodů\",Knt!$A$3,\"příjmení a jméno\",$A75)),-1,GETPIVOTDATA(\"Bodů\",Knt!$A$3,\"příjmení a jméno\",$A75))","v":7},{"$f":"IF(ISERR(GETPIVOTDATA(\"Součet z RZB\",Knt!$A$3,\"příjmení a jméno\",$A75)),0,GETPIVOTDATA(\"Součet z RZB\",Knt!$A$3,\"příjmení a jméno\",$A75))","v":4},{"$f":"IF(ISERR(GETPIVOTDATA(\"Součet z PZB\",Knt!$A$3,\"příjmení a jméno\",$A75)),0,GETPIVOTDATA(\"Součet z PZB\",Knt!$A$3,\"příjmení a jméno\",$A75))","v":0}]
[{"$f":"IF(Knt!A86=\" \",0,Knt!A86)","v":"Wi Alex"},{"$f":"IF(ISERR(GETPIVOTDATA(\"Bodů\",Knt!$A$3,\"příjmení a jméno\",$A76)),-1,GETPIVOTDATA(\"Bodů\",Knt!$A$3,\"příjmení a jméno\",$A76))","v":7},{"$f":"IF(ISERR(GETPIVOTDATA(\"Součet z RZB\",Knt!$A$3,\"příjmení a jméno\",$A76)),0,GETPIVOTDATA(\"Součet z RZB\",Knt!$A$3,\"příjmení a jméno\",$A76))","v":2},{"$f":"IF(ISERR(GETPIVOTDATA(\"Součet z PZB\",Knt!$A$3,\"příjmení a jméno\",$A76)),0,GETPIVOTDATA(\"Součet z PZB\",Knt!$A$3,\"příjmení a jméno\",$A76))","v":3}]
[{"$f":"IF(Knt!A79=\" \",0,Knt!A79)","v":"Románek Jakub"},{"$f":"IF(ISERR(GETPIVOTDATA(\"Bodů\",Knt!$A$3,\"příjmení a jméno\",$A77)),-1,GETPIVOTDATA(\"Bodů\",Knt!$A$3,\"příjmení a jméno\",$A77))","v":7},{"$f":"IF(ISERR(GETPIVOTDATA(\"Součet z RZB\",Knt!$A$3,\"příjmení a jméno\",$A77)),0,GETPIVOTDATA(\"Součet z RZB\",Knt!$A$3,\"příjmení a jméno\",$A77))","v":1},{"$f":"IF(ISERR(GETPIVOTDATA(\"Součet z PZB\",Knt!$A$3,\"příjmení a jméno\",$A77)),0,GETPIVOTDATA(\"Součet z PZB\",Knt!$A$3,\"příjmení a jméno\",$A77))","v":1.5}]
[{"$f":"IF(Knt!A82=\" \",0,Knt!A82)","v":"Černá Veronika"},{"$f":"IF(ISERR(GETPIVOTDATA(\"Bodů\",Knt!$A$3,\"příjmení a jméno\",$A78)),-1,GETPIVOTDATA(\"Bodů\",Knt!$A$3,\"příjmení a jméno\",$A78))","v":7},{"$f":"IF(ISERR(GETPIVOTDATA(\"Součet z RZB\",Knt!$A$3,\"příjmení a jméno\",$A78)),0,GETPIVOTDATA(\"Součet z RZB\",Knt!$A$3,\"příjmení a jméno\",$A78))","v":-1},{"$f":"IF(ISERR(GETPIVOTDATA(\"Součet z PZB\",Knt!$A$3,\"příjmení a jméno\",$A78)),0,GETPIVOTDATA(\"Součet z PZB\",Knt!$A$3,\"příjmení a jméno\",$A78))","v":0.8}]
[{"$f":"IF(Knt!A84=\" \",0,Knt!A84)","v":"Wojtas Ines"},{"$f":"IF(ISERR(GETPIVOTDATA(\"Bodů\",Knt!$A$3,\"příjmení a jméno\",$A79)),-1,GETPIVOTDATA(\"Bodů\",Knt!$A$3,\"příjmení a jméno\",$A79))","v":7},{"$f":"IF(ISERR(GETPIVOTDATA(\"Součet z RZB\",Knt!$A$3,\"příjmení a jméno\",$A79)),0,GETPIVOTDATA(\"Součet z RZB\",Knt!$A$3,\"příjmení a jméno\",$A79))","v":-1},{"$f":"IF(ISERR(GETPIVOTDATA(\"Součet z PZB\",Knt!$A$3,\"příjmení a jméno\",$A79)),0,GETPIVOTDATA(\"Součet z PZB\",Knt!$A$3,\"příjmení a jméno\",$A79))","v":0.75}]
[{"$f":"IF(Knt!A81=\" \",0,Knt!A81)","v":"Havelka Josef"},{"$f":"IF(ISERR(GETPIVOTDATA(\"Bodů\",Knt!$A$3,\"příjmení a jméno\",$A80)),-1,GETPIVOTDATA(\"Bodů\",Knt!$A$3,\"příjmení a jméno\",$A80))","v":7},{"$f":"IF(ISERR(GETPIVOTDATA(\"Součet z RZB\",Knt!$A$3,\"příjmení a jméno\",$A80)),0,GETPIVOTDATA(\"Součet z RZB\",Knt!$A$3,\"příjmení a jméno\",$A80))","v":-2},{"$f":"IF(ISERR(GETPIVOTDATA(\"Součet z PZB\",Knt!$A$3,\"příjmení a jméno\",$A80)),0,GETPIVOTDATA(\"Součet z PZB\",Knt!$A$3,\"příjmení a jméno\",$A80))","v":0.66666666666666663}]
[{"$f":"IF(Knt!A85=\" \",0,Knt!A85)","v":"Kristen Vilém"},{"$f":"IF(ISERR(GETPIVOTDATA(\"Bodů\",Knt!$A$3,\"příjmení a jméno\",$A81)),-1,GETPIVOTDATA(\"Bodů\",Knt!$A$3,\"příjmení a jméno\",$A81))","v":7},{"$f":"IF(ISERR(GETPIVOTDATA(\"Součet z RZB\",Knt!$A$3,\"příjmení a jméno\",$A81)),0,GETPIVOTDATA(\"Součet z RZB\",Knt!$A$3,\"příjmení a jméno\",$A81))","v":-3},{"$f":"IF(ISERR(GETPIVOTDATA(\"Součet z PZB\",Knt!$A$3,\"příjmení a jméno\",$A81)),0,GETPIVOTDATA(\"Součet z PZB\",Knt!$A$3,\"příjmení a jméno\",$A81))","v":0.5714285714285714}]
[{"$f":"IF(Knt!A78=\" \",0,Knt!A78)","v":"Válek Prokop"},{"$f":"IF(ISERR(GETPIVOTDATA(\"Bodů\",Knt!$A$3,\"příjmení a jméno\",$A82)),-1,GETPIVOTDATA(\"Bodů\",Knt!$A$3,\"příjmení a jméno\",$A82))","v":7},{"$f":"IF(ISERR(GETPIVOTDATA(\"Součet z RZB\",Knt!$A$3,\"příjmení a jméno\",$A82)),0,GETPIVOTDATA(\"Součet z RZB\",Knt!$A$3,\"příjmení a jméno\",$A82))","v":-5},{"$f":"IF(ISERR(GETPIVOTDATA(\"Součet z PZB\",Knt!$A$3,\"příjmení a jméno\",$A82)),0,GETPIVOTDATA(\"Součet z PZB\",Knt!$A$3,\"příjmení a jméno\",$A82))","v":0.44444444444444442}]
[{"$f":"IF(Knt!A89=\" \",0,Knt!A89)","v":"Gal Richard"},{"$f":"IF(ISERR(GETPIVOTDATA(\"Bodů\",Knt!$A$3,\"příjmení a jméno\",$A83)),-1,GETPIVOTDATA(\"Bodů\",Knt!$A$3,\"příjmení a jméno\",$A83))","v":6},{"$f":"IF(ISERR(GETPIVOTDATA(\"Součet z RZB\",Knt!$A$3,\"příjmení a jméno\",$A83)),0,GETPIVOTDATA(\"Součet z RZB\",Knt!$A$3,\"příjmení a jméno\",$A83))","v":3},{"$f":"IF(ISERR(GETPIVOTDATA(\"Součet z PZB\",Knt!$A$3,\"příjmení a jméno\",$A83)),0,GETPIVOTDATA(\"Součet z PZB\",Knt!$A$3,\"příjmení a jméno\",$A83))","v":0}]
[{"$f":"IF(Knt!A87=\" \",0,Knt!A87)","v":"Žmuda Maja"},{"$f":"IF(ISERR(GETPIVOTDATA(\"Bodů\",Knt!$A$3,\"příjmení a jméno\",$A84)),-1,GETPIVOTDATA(\"Bodů\",Knt!$A$3,\"příjmení a jméno\",$A84))","v":6},{"$f":"IF(ISERR(GETPIVOTDATA(\"Součet z RZB\",Knt!$A$3,\"příjmení a jméno\",$A84)),0,GETPIVOTDATA(\"Součet z RZB\",Knt!$A$3,\"příjmení a jméno\",$A84))","v":3},{"$f":"IF(ISERR(GETPIVOTDATA(\"Součet z PZB\",Knt!$A$3,\"příjmení a jméno\",$A84)),0,GETPIVOTDATA(\"Součet z PZB\",Knt!$A$3,\"příjmení a jméno\",$A84))","v":0}]
[{"$f":"IF(Knt!A97=\" \",0,Knt!A97)","v":"Tomek Vojtěch"},{"$f":"IF(ISERR(GETPIVOTDATA(\"Bodů\",Knt!$A$3,\"příjmení a jméno\",$A85)),-1,GETPIVOTDATA(\"Bodů\",Knt!$A$3,\"příjmení a jméno\",$A85))","v":6},{"$f":"IF(ISERR(GETPIVOTDATA(\"Součet z RZB\",Knt!$A$3,\"příjmení a jméno\",$A85)),0,GETPIVOTDATA(\"Součet z RZB\",Knt!$A$3,\"příjmení a jméno\",$A85))","v":3},{"$f":"IF(ISERR(GETPIVOTDATA(\"Součet z PZB\",Knt!$A$3,\"příjmení a jméno\",$A85)),0,GETPIVOTDATA(\"Součet z PZB\",Knt!$A$3,\"příjmení a jméno\",$A85))","v":0}]
[{"$f":"IF(Knt!A99=\" \",0,Knt!A99)","v":"Schwarz Šimon"},{"$f":"IF(ISERR(GETPIVOTDATA(\"Bodů\",Knt!$A$3,\"příjmení a jméno\",$A86)),-1,GETPIVOTDATA(\"Bodů\",Knt!$A$3,\"příjmení a jméno\",$A86))","v":6},{"$f":"IF(ISERR(GETPIVOTDATA(\"Součet z RZB\",Knt!$A$3,\"příjmení a jméno\",$A86)),0,GETPIVOTDATA(\"Součet z RZB\",Knt!$A$3,\"příjmení a jméno\",$A86))","v":3},{"$f":"IF(ISERR(GETPIVOTDATA(\"Součet z PZB\",Knt!$A$3,\"příjmení a jméno\",$A86)),0,GETPIVOTDATA(\"Součet z PZB\",Knt!$A$3,\"příjmení a jméno\",$A86))","v":0}]
[{"$f":"IF(Knt!A98=\" \",0,Knt!A98)","v":"Vrbas Alexandr"},{"$f":"IF(ISERR(GETPIVOTDATA(\"Bodů\",Knt!$A$3,\"příjmení a jméno\",$A87)),-1,GETPIVOTDATA(\"Bodů\",Knt!$A$3,\"příjmení a jméno\",$A87))","v":6},{"$f":"IF(ISERR(GETPIVOTDATA(\"Součet z RZB\",Knt!$A$3,\"příjmení a jméno\",$A87)),0,GETPIVOTDATA(\"Součet z RZB\",Knt!$A$3,\"příjmení a jméno\",$A87))","v":3},{"$f":"IF(ISERR(GETPIVOTDATA(\"Součet z PZB\",Knt!$A$3,\"příjmení a jméno\",$A87)),0,GETPIVOTDATA(\"Součet z PZB\",Knt!$A$3,\"příjmení a jméno\",$A87))","v":0}]
[{"$f":"IF(Knt!A91=\" \",0,Knt!A91)","v":"Brada Tomáš"},{"$f":"IF(ISERR(GETPIVOTDATA(\"Bodů\",Knt!$A$3,\"příjmení a jméno\",$A88)),-1,GETPIVOTDATA(\"Bodů\",Knt!$A$3,\"příjmení a jméno\",$A88))","v":6},{"$f":"IF(ISERR(GETPIVOTDATA(\"Součet z RZB\",Knt!$A$3,\"příjmení a jméno\",$A88)),0,GETPIVOTDATA(\"Součet z RZB\",Knt!$A$3,\"příjmení a jméno\",$A88))","v":3},{"$f":"IF(ISERR(GETPIVOTDATA(\"Součet z PZB\",Knt!$A$3,\"příjmení a jméno\",$A88)),0,GETPIVOTDATA(\"Součet z PZB\",Knt!$A$3,\"příjmení a jméno\",$A88))","v":0}]
[{"$f":"IF(Knt!A100=\" \",0,Knt!A100)","v":"Krischke Simon"},{"$f":"IF(ISERR(GETPIVOTDATA(\"Bodů\",Knt!$A$3,\"příjmení a jméno\",$A89)),-1,GETPIVOTDATA(\"Bodů\",Knt!$A$3,\"příjmení a jméno\",$A89))","v":6},{"$f":"IF(ISERR(GETPIVOTDATA(\"Součet z RZB\",Knt!$A$3,\"příjmení a jméno\",$A89)),0,GETPIVOTDATA(\"Součet z RZB\",Knt!$A$3,\"příjmení a jméno\",$A89))","v":3},{"$f":"IF(ISERR(GETPIVOTDATA(\"Součet z PZB\",Knt!$A$3,\"příjmení a jméno\",$A89)),0,GETPIVOTDATA(\"Součet z PZB\",Knt!$A$3,\"příjmení a jméno\",$A89))","v":0}]
[{"$f":"IF(Knt!A90=\" \",0,Knt!A90)","v":"Urban Matěj"},{"$f":"IF(ISERR(GETPIVOTDATA(\"Bodů\",Knt!$A$3,\"příjmení a jméno\",$A90)),-1,GETPIVOTDATA(\"Bodů\",Knt!$A$3,\"příjmení a jméno\",$A90))","v":6},{"$f":"IF(ISERR(GETPIVOTDATA(\"Součet z RZB\",Knt!$A$3,\"příjmení a jméno\",$A90)),0,GETPIVOTDATA(\"Součet z RZB\",Knt!$A$3,\"příjmení a jméno\",$A90))","v":3},{"$f":"IF(ISERR(GETPIVOTDATA(\"Součet z PZB\",Knt!$A$3,\"příjmení a jméno\",$A90)),0,GETPIVOTDATA(\"Součet z PZB\",Knt!$A$3,\"příjmení a jméno\",$A90))","v":0}]
[{"$f":"IF(Knt!A102=\" \",0,Knt!A102)","v":"Beutel David"},{"$f":"IF(ISERR(GETPIVOTDATA(\"Bodů\",Knt!$A$3,\"příjmení a jméno\",$A91)),-1,GETPIVOTDATA(\"Bodů\",Knt!$A$3,\"příjmení a jméno\",$A91))","v":6},{"$f":"IF(ISERR(GETPIVOTDATA(\"Součet z RZB\",Knt!$A$3,\"příjmení a jméno\",$A91)),0,GETPIVOTDATA(\"Součet z RZB\",Knt!$A$3,\"příjmení a jméno\",$A91))","v":3},{"$f":"IF(ISERR(GETPIVOTDATA(\"Součet z PZB\",Knt!$A$3,\"příjmení a jméno\",$A91)),0,GETPIVOTDATA(\"Součet z PZB\",Knt!$A$3,\"příjmení a jméno\",$A91))","v":0}]
[{"$f":"IF(Knt!A96=\" \",0,Knt!A96)","v":"Rojíček Jan"},{"$f":"IF(ISERR(GETPIVOTDATA(\"Bodů\",Knt!$A$3,\"příjmení a jméno\",$A92)),-1,GETPIVOTDATA(\"Bodů\",Knt!$A$3,\"příjmení a jméno\",$A92))","v":6},{"$f":"IF(ISERR(GETPIVOTDATA(\"Součet z RZB\",Knt!$A$3,\"příjmení a jméno\",$A92)),0,GETPIVOTDATA(\"Součet z RZB\",Knt!$A$3,\"příjmení a jméno\",$A92))","v":3},{"$f":"IF(ISERR(GETPIVOTDATA(\"Součet z PZB\",Knt!$A$3,\"příjmení a jméno\",$A92)),0,GETPIVOTDATA(\"Součet z PZB\",Knt!$A$3,\"příjmení a jméno\",$A92))","v":0}]
[{"$f":"IF(Knt!A92=\" \",0,Knt!A92)","v":"Grym Petr"},{"$f":"IF(ISERR(GETPIVOTDATA(\"Bodů\",Knt!$A$3,\"příjmení a jméno\",$A93)),-1,GETPIVOTDATA(\"Bodů\",Knt!$A$3,\"příjmení a jméno\",$A93))","v":6},{"$f":"IF(ISERR(GETPIVOTDATA(\"Součet z RZB\",Knt!$A$3,\"příjmení a jméno\",$A93)),0,GETPIVOTDATA(\"Součet z RZB\",Knt!$A$3,\"příjmení a jméno\",$A93))","v":1},{"$f":"IF(ISERR(GETPIVOTDATA(\"Součet z PZB\",Knt!$A$3,\"příjmení a jméno\",$A93)),0,GETPIVOTDATA(\"Součet z PZB\",Knt!$A$3,\"příjmení a jméno\",$A93))","v":1.5}]
[{"$f":"IF(Knt!A93=\" \",0,Knt!A93)","v":"Mohyla David"},{"$f":"IF(ISERR(GETPIVOTDATA(\"Bodů\",Knt!$A$3,\"příjmení a jméno\",$A94)),-1,GETPIVOTDATA(\"Bodů\",Knt!$A$3,\"příjmení a jméno\",$A94))","v":6},{"$f":"IF(ISERR(GETPIVOTDATA(\"Součet z RZB\",Knt!$A$3,\"příjmení a jméno\",$A94)),0,GETPIVOTDATA(\"Součet z RZB\",Knt!$A$3,\"příjmení a jméno\",$A94))","v":1},{"$f":"IF(ISERR(GETPIVOTDATA(\"Součet z PZB\",Knt!$A$3,\"příjmení a jméno\",$A94)),0,GETPIVOTDATA(\"Součet z PZB\",Knt!$A$3,\"příjmení a jméno\",$A94))","v":1.5}]
[{"$f":"IF(Knt!A101=\" \",0,Knt!A101)","v":"Vrbas Alexander"},{"$f":"IF(ISERR(GETPIVOTDATA(\"Bodů\",Knt!$A$3,\"příjmení a jméno\",$A95)),-1,GETPIVOTDATA(\"Bodů\",Knt!$A$3,\"příjmení a jméno\",$A95))","v":6},{"$f":"IF(ISERR(GETPIVOTDATA(\"Součet z RZB\",Knt!$A$3,\"příjmení a jméno\",$A95)),0,GETPIVOTDATA(\"Součet z RZB\",Knt!$A$3,\"příjmení a jméno\",$A95))","v":1},{"$f":"IF(ISERR(GETPIVOTDATA(\"Součet z PZB\",Knt!$A$3,\"příjmení a jméno\",$A95)),0,GETPIVOTDATA(\"Součet z PZB\",Knt!$A$3,\"příjmení a jméno\",$A95))","v":1.3333333333333333}]
[{"$f":"IF(Knt!A94=\" \",0,Knt!A94)","v":"Muráň Tomáš"},{"$f":"IF(ISERR(GETPIVOTDATA(\"Bodů\",Knt!$A$3,\"příjmení a jméno\",$A96)),-1,GETPIVOTDATA(\"Bodů\",Knt!$A$3,\"příjmení a jméno\",$A96))","v":6},{"$f":"IF(ISERR(GETPIVOTDATA(\"Součet z RZB\",Knt!$A$3,\"příjmení a jméno\",$A96)),0,GETPIVOTDATA(\"Součet z RZB\",Knt!$A$3,\"příjmení a jméno\",$A96))","v":0},{"$f":"IF(ISERR(GETPIVOTDATA(\"Součet z PZB\",Knt!$A$3,\"příjmení a jméno\",$A96)),0,GETPIVOTDATA(\"Součet z PZB\",Knt!$A$3,\"příjmení a jméno\",$A96))","v":1}]
[{"$f":"IF(Knt!A95=\" \",0,Knt!A95)","v":"Pindor Miroslav"},{"$f":"IF(ISERR(GETPIVOTDATA(\"Bodů\",Knt!$A$3,\"příjmení a jméno\",$A97)),-1,GETPIVOTDATA(\"Bodů\",Knt!$A$3,\"příjmení a jméno\",$A97))","v":6},{"$f":"IF(ISERR(GETPIVOTDATA(\"Součet z RZB\",Knt!$A$3,\"příjmení a jméno\",$A97)),0,GETPIVOTDATA(\"Součet z RZB\",Knt!$A$3,\"příjmení a jméno\",$A97))","v":0},{"$f":"IF(ISERR(GETPIVOTDATA(\"Součet z PZB\",Knt!$A$3,\"příjmení a jméno\",$A97)),0,GETPIVOTDATA(\"Součet z PZB\",Knt!$A$3,\"příjmení a jméno\",$A97))","v":1}]
[{"$f":"IF(Knt!A88=\" \",0,Knt!A88)","v":"Caletka Michal"},{"$f":"IF(ISERR(GETPIVOTDATA(\"Bodů\",Knt!$A$3,\"příjmení a jméno\",$A98)),-1,GETPIVOTDATA(\"Bodů\",Knt!$A$3,\"příjmení a jméno\",$A98))","v":6},{"$f":"IF(ISERR(GETPIVOTDATA(\"Součet z RZB\",Knt!$A$3,\"příjmení a jméno\",$A98)),0,GETPIVOTDATA(\"Součet z RZB\",Knt!$A$3,\"příjmení a jméno\",$A98))","v":-6},{"$f":"IF(ISERR(GETPIVOTDATA(\"Součet z PZB\",Knt!$A$3,\"příjmení a jméno\",$A98)),0,GETPIVOTDATA(\"Součet z PZB\",Knt!$A$3,\"příjmení a jméno\",$A98))","v":0.25}]
[{"$f":"IF(Knt!A113=\" \",0,Knt!A113)","v":"Salzman Václav"},{"$f":"IF(ISERR(GETPIVOTDATA(\"Bodů\",Knt!$A$3,\"příjmení a jméno\",$A99)),-1,GETPIVOTDATA(\"Bodů\",Knt!$A$3,\"příjmení a jméno\",$A99))","v":5},{"$f":"IF(ISERR(GETPIVOTDATA(\"Součet z RZB\",Knt!$A$3,\"příjmení a jméno\",$A99)),0,GETPIVOTDATA(\"Součet z RZB\",Knt!$A$3,\"příjmení a jméno\",$A99))","v":2},{"$f":"IF(ISERR(GETPIVOTDATA(\"Součet z PZB\",Knt!$A$3,\"příjmení a jméno\",$A99)),0,GETPIVOTDATA(\"Součet z PZB\",Knt!$A$3,\"příjmení a jméno\",$A99))","v":3}]
[{"$f":"IF(Knt!A115=\" \",0,Knt!A115)","v":"Salek Natalia"},{"$f":"IF(ISERR(GETPIVOTDATA(\"Bodů\",Knt!$A$3,\"příjmení a jméno\",$A100)),-1,GETPIVOTDATA(\"Bodů\",Knt!$A$3,\"příjmení a jméno\",$A100))","v":5},{"$f":"IF(ISERR(GETPIVOTDATA(\"Součet z RZB\",Knt!$A$3,\"příjmení a jméno\",$A100)),0,GETPIVOTDATA(\"Součet z RZB\",Knt!$A$3,\"příjmení a jméno\",$A100))","v":2},{"$f":"IF(ISERR(GETPIVOTDATA(\"Součet z PZB\",Knt!$A$3,\"příjmení a jméno\",$A100)),0,GETPIVOTDATA(\"Součet z PZB\",Knt!$A$3,\"příjmení a jméno\",$A100))","v":3}]
[{"$f":"IF(Knt!A109=\" \",0,Knt!A109)","v":"Kožušník Vojtěch"},{"$f":"IF(ISERR(GETPIVOTDATA(\"Bodů\",Knt!$A$3,\"příjmení a jméno\",$A101)),-1,GETPIVOTDATA(\"Bodů\",Knt!$A$3,\"příjmení a jméno\",$A101))","v":5},{"$f":"IF(ISERR(GETPIVOTDATA(\"Součet z RZB\",Knt!$A$3,\"příjmení a jméno\",$A101)),0,GETPIVOTDATA(\"Součet z RZB\",Knt!$A$3,\"příjmení a jméno\",$A101))","v":2},{"$f":"IF(ISERR(GETPIVOTDATA(\"Součet z PZB\",Knt!$A$3,\"příjmení a jméno\",$A101)),0,GETPIVOTDATA(\"Součet z PZB\",Knt!$A$3,\"příjmení a jméno\",$A101))","v":0}]
[{"$f":"IF(Knt!A117=\" \",0,Knt!A117)","v":"Mikendová Tereza"},{"$f":"IF(ISERR(GETPIVOTDATA(\"Bodů\",Knt!$A$3,\"příjmení a jméno\",$A102)),-1,GETPIVOTDATA(\"Bodů\",Knt!$A$3,\"příjmení a jméno\",$A102))","v":5},{"$f":"IF(ISERR(GETPIVOTDATA(\"Součet z RZB\",Knt!$A$3,\"příjmení a jméno\",$A102)),0,GETPIVOTDATA(\"Součet z RZB\",Knt!$A$3,\"příjmení a jméno\",$A102))","v":2},{"$f":"IF(ISERR(GETPIVOTDATA(\"Součet z PZB\",Knt!$A$3,\"příjmení a jméno\",$A102)),0,GETPIVOTDATA(\"Součet z PZB\",Knt!$A$3,\"příjmení a jméno\",$A102))","v":0}]
[{"$f":"IF(Knt!A114=\" \",0,Knt!A114)","v":"Hegner Leoš"},{"$f":"IF(ISERR(GETPIVOTDATA(\"Bodů\",Knt!$A$3,\"příjmení a jméno\",$A103)),-1,GETPIVOTDATA(\"Bodů\",Knt!$A$3,\"příjmení a jméno\",$A103))","v":5},{"$f":"IF(ISERR(GETPIVOTDATA(\"Součet z RZB\",Knt!$A$3,\"příjmení a jméno\",$A103)),0,GETPIVOTDATA(\"Součet z RZB\",Knt!$A$3,\"příjmení a jméno\",$A103))","v":2},{"$f":"IF(ISERR(GETPIVOTDATA(\"Součet z PZB\",Knt!$A$3,\"příjmení a jméno\",$A103)),0,GETPIVOTDATA(\"Součet z PZB\",Knt!$A$3,\"příjmení a jméno\",$A103))","v":0}]
[{"$f":"IF(Knt!A111=\" \",0,Knt!A111)","v":"Strachota Vojtěch"},{"$f":"IF(ISERR(GETPIVOTDATA(\"Bodů\",Knt!$A$3,\"příjmení a jméno\",$A104)),-1,GETPIVOTDATA(\"Bodů\",Knt!$A$3,\"příjmení a jméno\",$A104))","v":5},{"$f":"IF(ISERR(GETPIVOTDATA(\"Součet z RZB\",Knt!$A$3,\"příjmení a jméno\",$A104)),0,GETPIVOTDATA(\"Součet z RZB\",Knt!$A$3,\"příjmení a jméno\",$A104))","v":2},{"$f":"IF(ISERR(GETPIVOTDATA(\"Součet z PZB\",Knt!$A$3,\"příjmení a jméno\",$A104)),0,GETPIVOTDATA(\"Součet z PZB\",Knt!$A$3,\"příjmení a jméno\",$A104))","v":0}]
[{"$f":"IF(Knt!A104=\" \",0,Knt!A104)","v":"Přikryl Tomáš"},{"$f":"IF(ISERR(GETPIVOTDATA(\"Bodů\",Knt!$A$3,\"příjmení a jméno\",$A105)),-1,GETPIVOTDATA(\"Bodů\",Knt!$A$3,\"příjmení a jméno\",$A105))","v":5},{"$f":"IF(ISERR(GETPIVOTDATA(\"Součet z RZB\",Knt!$A$3,\"příjmení a jméno\",$A105)),0,GETPIVOTDATA(\"Součet z RZB\",Knt!$A$3,\"příjmení a jméno\",$A105))","v":2},{"$f":"IF(ISERR(GETPIVOTDATA(\"Součet z PZB\",Knt!$A$3,\"příjmení a jméno\",$A105)),0,GETPIVOTDATA(\"Součet z PZB\",Knt!$A$3,\"příjmení a jméno\",$A105))","v":0}]
[{"$f":"IF(Knt!A116=\" \",0,Knt!A116)","v":"Kristýna Kazsperová"},{"$f":"IF(ISERR(GETPIVOTDATA(\"Bodů\",Knt!$A$3,\"příjmení a jméno\",$A106)),-1,GETPIVOTDATA(\"Bodů\",Knt!$A$3,\"příjmení a jméno\",$A106))","v":5},{"$f":"IF(ISERR(GETPIVOTDATA(\"Součet z RZB\",Knt!$A$3,\"příjmení a jméno\",$A106)),0,GETPIVOTDATA(\"Součet z RZB\",Knt!$A$3,\"příjmení a jméno\",$A106))","v":2},{"$f":"IF(ISERR(GETPIVOTDATA(\"Součet z PZB\",Knt!$A$3,\"příjmení a jméno\",$A106)),0,GETPIVOTDATA(\"Součet z PZB\",Knt!$A$3,\"příjmení a jméno\",$A106))","v":0}]
[{"$f":"IF(Knt!A112=\" \",0,Knt!A112)","v":"Šebesta Jakub"},{"$f":"IF(ISERR(GETPIVOTDATA(\"Bodů\",Knt!$A$3,\"příjmení a jméno\",$A107)),-1,GETPIVOTDATA(\"Bodů\",Knt!$A$3,\"příjmení a jméno\",$A107))","v":5},{"$f":"IF(ISERR(GETPIVOTDATA(\"Součet z RZB\",Knt!$A$3,\"příjmení a jméno\",$A107)),0,GETPIVOTDATA(\"Součet z RZB\",Knt!$A$3,\"příjmení a jméno\",$A107))","v":1},{"$f":"IF(ISERR(GETPIVOTDATA(\"Součet z PZB\",Knt!$A$3,\"příjmení a jméno\",$A107)),0,GETPIVOTDATA(\"Součet z PZB\",Knt!$A$3,\"příjmení a jméno\",$A107))","v":2}]
[{"$f":"IF(Knt!A108=\" \",0,Knt!A108)","v":"Vlaškovský Lukáš"},{"$f":"IF(ISERR(GETPIVOTDATA(\"Bodů\",Knt!$A$3,\"příjmení a jméno\",$A108)),-1,GETPIVOTDATA(\"Bodů\",Knt!$A$3,\"příjmení a jméno\",$A108))","v":5},{"$f":"IF(ISERR(GETPIVOTDATA(\"Součet z RZB\",Knt!$A$3,\"příjmení a jméno\",$A108)),0,GETPIVOTDATA(\"Součet z RZB\",Knt!$A$3,\"příjmení a jméno\",$A108))","v":0},{"$f":"IF(ISERR(GETPIVOTDATA(\"Součet z PZB\",Knt!$A$3,\"příjmení a jméno\",$A108)),0,GETPIVOTDATA(\"Součet z PZB\",Knt!$A$3,\"příjmení a jméno\",$A108))","v":1}]
[{"$f":"IF(Knt!A103=\" \",0,Knt!A103)","v":"Kolář Václav"},{"$f":"IF(ISERR(GETPIVOTDATA(\"Bodů\",Knt!$A$3,\"příjmení a jméno\",$A109)),-1,GETPIVOTDATA(\"Bodů\",Knt!$A$3,\"příjmení a jméno\",$A109))","v":5},{"$f":"IF(ISERR(GETPIVOTDATA(\"Součet z RZB\",Knt!$A$3,\"příjmení a jméno\",$A109)),0,GETPIVOTDATA(\"Součet z RZB\",Knt!$A$3,\"příjmení a jméno\",$A109))","v":-1},{"$f":"IF(ISERR(GETPIVOTDATA(\"Součet z PZB\",Knt!$A$3,\"příjmení a jméno\",$A109)),0,GETPIVOTDATA(\"Součet z PZB\",Knt!$A$3,\"příjmení a jméno\",$A109))","v":0.75}]
[{"$f":"IF(Knt!A106=\" \",0,Knt!A106)","v":"Válek Matěj"},{"$f":"IF(ISERR(GETPIVOTDATA(\"Bodů\",Knt!$A$3,\"příjmení a jméno\",$A110)),-1,GETPIVOTDATA(\"Bodů\",Knt!$A$3,\"příjmení a jméno\",$A110))","v":5},{"$f":"IF(ISERR(GETPIVOTDATA(\"Součet z RZB\",Knt!$A$3,\"příjmení a jméno\",$A110)),0,GETPIVOTDATA(\"Součet z RZB\",Knt!$A$3,\"příjmení a jméno\",$A110))","v":-1},{"$f":"IF(ISERR(GETPIVOTDATA(\"Součet z PZB\",Knt!$A$3,\"příjmení a jméno\",$A110)),0,GETPIVOTDATA(\"Součet z PZB\",Knt!$A$3,\"příjmení a jméno\",$A110))","v":0.75}]
[{"$f":"IF(Knt!A107=\" \",0,Knt!A107)","v":"Matušek Jakub"},{"$f":"IF(ISERR(GETPIVOTDATA(\"Bodů\",Knt!$A$3,\"příjmení a jméno\",$A111)),-1,GETPIVOTDATA(\"Bodů\",Knt!$A$3,\"příjmení a jméno\",$A111))","v":5},{"$f":"IF(ISERR(GETPIVOTDATA(\"Součet z RZB\",Knt!$A$3,\"příjmení a jméno\",$A111)),0,GETPIVOTDATA(\"Součet z RZB\",Knt!$A$3,\"příjmení a jméno\",$A111))","v":-1},{"$f":"IF(ISERR(GETPIVOTDATA(\"Součet z PZB\",Knt!$A$3,\"příjmení a jméno\",$A111)),0,GETPIVOTDATA(\"Součet z PZB\",Knt!$A$3,\"příjmení a jméno\",$A111))","v":0.75}]
[{"$f":"IF(Knt!A105=\" \",0,Knt!A105)","v":"Holaň Erik"},{"$f":"IF(ISERR(GETPIVOTDATA(\"Bodů\",Knt!$A$3,\"příjmení a jméno\",$A112)),-1,GETPIVOTDATA(\"Bodů\",Knt!$A$3,\"příjmení a jméno\",$A112))","v":5},{"$f":"IF(ISERR(GETPIVOTDATA(\"Součet z RZB\",Knt!$A$3,\"příjmení a jméno\",$A112)),0,GETPIVOTDATA(\"Součet z RZB\",Knt!$A$3,\"příjmení a jméno\",$A112))","v":-1},{"$f":"IF(ISERR(GETPIVOTDATA(\"Součet z PZB\",Knt!$A$3,\"příjmení a jméno\",$A112)),0,GETPIVOTDATA(\"Součet z PZB\",Knt!$A$3,\"příjmení a jméno\",$A112))","v":0.66666666666666663}]
[{"$f":"IF(Knt!A110=\" \",0,Knt!A110)","v":"Weiser Mikuláš"},{"$f":"IF(ISERR(GETPIVOTDATA(\"Bodů\",Knt!$A$3,\"příjmení a jméno\",$A113)),-1,GETPIVOTDATA(\"Bodů\",Knt!$A$3,\"příjmení a jméno\",$A113))","v":5},{"$f":"IF(ISERR(GETPIVOTDATA(\"Součet z RZB\",Knt!$A$3,\"příjmení a jméno\",$A113)),0,GETPIVOTDATA(\"Součet z RZB\",Knt!$A$3,\"příjmení a jméno\",$A113))","v":-3},{"$f":"IF(ISERR(GETPIVOTDATA(\"Součet z PZB\",Knt!$A$3,\"příjmení a jméno\",$A113)),0,GETPIVOTDATA(\"Součet z PZB\",Knt!$A$3,\"příjmení a jméno\",$A113))","v":0.25}]
[{"$f":"IF(Knt!A118=\" \",0,Knt!A118)","v":"Hladík Václav"},{"$f":"IF(ISERR(GETPIVOTDATA(\"Bodů\",Knt!$A$3,\"příjmení a jméno\",$A114)),-1,GETPIVOTDATA(\"Bodů\",Knt!$A$3,\"příjmení a jméno\",$A114))","v":5},{"$f":"IF(ISERR(GETPIVOTDATA(\"Součet z RZB\",Knt!$A$3,\"příjmení a jméno\",$A114)),0,GETPIVOTDATA(\"Součet z RZB\",Knt!$A$3,\"příjmení a jméno\",$A114))","v":-4},{"$f":"IF(ISERR(GETPIVOTDATA(\"Součet z PZB\",Knt!$A$3,\"příjmení a jméno\",$A114)),0,GETPIVOTDATA(\"Součet z PZB\",Knt!$A$3,\"příjmení a jméno\",$A114))","v":0.33333333333333331}]
[{"$f":"IF(Knt!A121=\" \",0,Knt!A121)","v":"Kolář  Václav"},{"$f":"IF(ISERR(GETPIVOTDATA(\"Bodů\",Knt!$A$3,\"příjmení a jméno\",$A115)),-1,GETPIVOTDATA(\"Bodů\",Knt!$A$3,\"příjmení a jméno\",$A115))","v":4},{"$f":"IF(ISERR(GETPIVOTDATA(\"Součet z RZB\",Knt!$A$3,\"příjmení a jméno\",$A115)),0,GETPIVOTDATA(\"Součet z RZB\",Knt!$A$3,\"příjmení a jméno\",$A115))","v":1},{"$f":"IF(ISERR(GETPIVOTDATA(\"Součet z PZB\",Knt!$A$3,\"příjmení a jméno\",$A115)),0,GETPIVOTDATA(\"Součet z PZB\",Knt!$A$3,\"příjmení a jméno\",$A115))","v":2}]
[{"$f":"IF(Knt!A125=\" \",0,Knt!A125)","v":"Lukas Daniel"},{"$f":"IF(ISERR(GETPIVOTDATA(\"Bodů\",Knt!$A$3,\"příjmení a jméno\",$A116)),-1,GETPIVOTDATA(\"Bodů\",Knt!$A$3,\"příjmení a jméno\",$A116))","v":4},{"$f":"IF(ISERR(GETPIVOTDATA(\"Součet z RZB\",Knt!$A$3,\"příjmení a jméno\",$A116)),0,GETPIVOTDATA(\"Součet z RZB\",Knt!$A$3,\"příjmení a jméno\",$A116))","v":1},{"$f":"IF(ISERR(GETPIVOTDATA(\"Součet z PZB\",Knt!$A$3,\"příjmení a jméno\",$A116)),0,GETPIVOTDATA(\"Součet z PZB\",Knt!$A$3,\"příjmení a jméno\",$A116))","v":2}]
[{"$f":"IF(Knt!A124=\" \",0,Knt!A124)","v":"Skácel Antonín"},{"$f":"IF(ISERR(GETPIVOTDATA(\"Bodů\",Knt!$A$3,\"příjmení a jméno\",$A117)),-1,GETPIVOTDATA(\"Bodů\",Knt!$A$3,\"příjmení a jméno\",$A117))","v":4},{"$f":"IF(ISERR(GETPIVOTDATA(\"Součet z RZB\",Knt!$A$3,\"příjmení a jméno\",$A117)),0,GETPIVOTDATA(\"Součet z RZB\",Knt!$A$3,\"příjmení a jméno\",$A117))","v":1},{"$f":"IF(ISERR(GETPIVOTDATA(\"Součet z PZB\",Knt!$A$3,\"příjmení a jméno\",$A117)),0,GETPIVOTDATA(\"Součet z PZB\",Knt!$A$3,\"příjmení a jméno\",$A117))","v":2}]
[{"$f":"IF(Knt!A120=\" \",0,Knt!A120)","v":"Sedláček Vojtěch"},{"$f":"IF(ISERR(GETPIVOTDATA(\"Bodů\",Knt!$A$3,\"příjmení a jméno\",$A118)),-1,GETPIVOTDATA(\"Bodů\",Knt!$A$3,\"příjmení a jméno\",$A118))","v":4},{"$f":"IF(ISERR(GETPIVOTDATA(\"Součet z RZB\",Knt!$A$3,\"příjmení a jméno\",$A118)),0,GETPIVOTDATA(\"Součet z RZB\",Knt!$A$3,\"příjmení a jméno\",$A118))","v":1},{"$f":"IF(ISERR(GETPIVOTDATA(\"Součet z PZB\",Knt!$A$3,\"příjmení a jméno\",$A118)),0,GETPIVOTDATA(\"Součet z PZB\",Knt!$A$3,\"příjmení a jméno\",$A118))","v":0}]
[{"$f":"IF(Knt!A119=\" \",0,Knt!A119)","v":"Ciora Jakub"},{"$f":"IF(ISERR(GETPIVOTDATA(\"Bodů\",Knt!$A$3,\"příjmení a jméno\",$A119)),-1,GETPIVOTDATA(\"Bodů\",Knt!$A$3,\"příjmení a jméno\",$A119))","v":4},{"$f":"IF(ISERR(GETPIVOTDATA(\"Součet z RZB\",Knt!$A$3,\"příjmení a jméno\",$A119)),0,GETPIVOTDATA(\"Součet z RZB\",Knt!$A$3,\"příjmení a jméno\",$A119))","v":-2},{"$f":"IF(ISERR(GETPIVOTDATA(\"Součet z PZB\",Knt!$A$3,\"příjmení a jméno\",$A119)),0,GETPIVOTDATA(\"Součet z PZB\",Knt!$A$3,\"příjmení a jméno\",$A119))","v":0.6}]
[{"$f":"IF(Knt!A123=\" \",0,Knt!A123)","v":"Kopcová Eliška"},{"$f":"IF(ISERR(GETPIVOTDATA(\"Bodů\",Knt!$A$3,\"příjmení a jméno\",$A120)),-1,GETPIVOTDATA(\"Bodů\",Knt!$A$3,\"příjmení a jméno\",$A120))","v":4},{"$f":"IF(ISERR(GETPIVOTDATA(\"Součet z RZB\",Knt!$A$3,\"příjmení a jméno\",$A120)),0,GETPIVOTDATA(\"Součet z RZB\",Knt!$A$3,\"příjmení a jméno\",$A120))","v":-6},{"$f":"IF(ISERR(GETPIVOTDATA(\"Součet z PZB\",Knt!$A$3,\"příjmení a jméno\",$A120)),0,GETPIVOTDATA(\"Součet z PZB\",Knt!$A$3,\"příjmení a jméno\",$A120))","v":0.33333333333333331}]
[{"$f":"IF(Knt!A122=\" \",0,Knt!A122)","v":"Buček Dan"},{"$f":"IF(ISERR(GETPIVOTDATA(\"Bodů\",Knt!$A$3,\"příjmení a jméno\",$A121)),-1,GETPIVOTDATA(\"Bodů\",Knt!$A$3,\"příjmení a jméno\",$A121))","v":4},{"$f":"IF(ISERR(GETPIVOTDATA(\"Součet z RZB\",Knt!$A$3,\"příjmení a jméno\",$A121)),0,GETPIVOTDATA(\"Součet z RZB\",Knt!$A$3,\"příjmení a jméno\",$A121))","v":-13},{"$f":"IF(ISERR(GETPIVOTDATA(\"Součet z PZB\",Knt!$A$3,\"příjmení a jméno\",$A121)),0,GETPIVOTDATA(\"Součet z PZB\",Knt!$A$3,\"příjmení a jméno\",$A121))","v":0.13333333333333333}]

{"sheet":"Žebříček","index":4,"n_rows":43,"n_cols":8,"rows_kept":43,"cut":false,"hidden":false,"merged":[[0,0,0,7]]}
["Pořadí závodníků turnajů přípravek 2014"]
[]
["poř.","Příjmení a jméno","poř.","Příjmení a jméno","poř.","Příjmení a jméno","poř.","Příjmení a jméno"]
[1,{"$f":"IF('Seřazení Knt'!A2=0,\"\",'Seřazení Knt'!A2)","v":"Náplava Richard"},{"$f":"IF(D4=\"\",\"\",IF(AND('Seřazení Knt'!B41='Seřazení Knt'!B42,'Seřazení Knt'!C41='Seřazení Knt'!C42,'Seřazení Knt'!D41='Seřazení Knt'!D42),Žebříček!A43,Žebříček!A43+1))","v":38},{"$f":"IF('Seřazení Knt'!A42=0,\"\",'Seřazení Knt'!A42)","v":"Martinásek Šimon"},{"$f":"IF(F4=\"\",\"\",IF(AND('Seřazení Knt'!B81='Seřazení Knt'!B82,'Seřazení Knt'!C81='Seřazení Knt'!C82,'Seřazení Knt'!D81='Seřazení Knt'!D82),Žebříček!C43,Žebříček!C43+1))","v":67},{"$f":"IF('Seřazení Knt'!A82=0,\"\",'Seřazení Knt'!A82)","v":"Válek Prokop"},{"$f":"IF(H4=\"\",\"\",IF(AND('Seřazení Knt'!B121='Seřazení Knt'!B122,'Seřazení Knt'!C121='Seřazení Knt'!C122,'Seřazení Knt'!D121='Seřazení Knt'!D122),Žebříček!E43,Žebříček!E43+1))","v":""},{"$f":"IF('Seřazení Knt'!A122=0,\"\",'Seřazení Knt'!A122)","v":""}]
[{"$f":"IF(B5=\"\",\"\",IF(AND('Seřazení Knt'!B2='Seřazení Knt'!B3,'Seřazení Knt'!C2='Seřazení Knt'!C3,'Seřazení Knt'!D2='Seřazení Knt'!D3),Žebříček!A4,Žebříček!A4+1))","v":2},{"$f":"IF('Seřazení Knt'!A3=0,\"\",'Seřazení Knt'!A3)","v":"To Adam"},{"$f":"IF(D5=\"\",\"\",IF(AND('Seřazení Knt'!B42='Seřazení Knt'!B43,'Seřazení Knt'!C42='Seřazení Knt'!C43,'Seřazení Knt'!D42='Seřazení Knt'!D43),Žebříček!C4,Žebříček!C4+1))","v":39},{"$f":"IF('Seřazení Knt'!A43=0,\"\",'Seřazení Knt'!A43)","v":"Neckář Matěj"},{"$f":"IF(F5=\"\",\"\",IF(AND('Seřazení Knt'!B82='Seřazení Knt'!B83,'Seřazení Knt'!C82='Seřazení Knt'!C83,'Seřazení Knt'!D82='Seřazení Knt'!D83),Žebříček!E4,Žebříček!E4+1))","v":68},{"$f":"IF('Seřazení Knt'!A83=0,\"\",'Seřazení Knt'!A83)","v":"Gal Richard"},{"$f":"IF(H5=\"\",\"\",IF(AND('Seřazení Knt'!B122='Seřazení Knt'!B123,'Seřazení Knt'!C122='Seřazení Knt'!C123,'Seřazení Knt'!D122='Seřazení Knt'!D123),Žebříček!G4,Žebříček!G4+1))","v":""},{"$f":"IF('Seřazení Knt'!A123=0,\"\",'Seřazení Knt'!A123)","v":""}]
[{"$f":"IF(B6=\"\",\"\",IF(AND('Seřazení Knt'!B3='Seřazení Knt'!B4,'Seřazení Knt'!C3='Seřazení Knt'!C4,'Seřazení Knt'!D3='Seřazení Knt'!D4),Žebříček!A5,Žebříček!A5+1))","v":3},{"$f":"IF('Seřazení Knt'!A4=0,\"\",'Seřazení Knt'!A4)","v":"Vojkovský Dalibor"},{"$f":"IF(D6=\"\",\"\",IF(AND('Seřazení Knt'!B43='Seřazení Knt'!B44,'Seřazení Knt'!C43='Seřazení Knt'!C44,'Seřazení Knt'!D43='Seřazení Knt'!D44),Žebříček!C5,Žebříček!C5+1))","v":40},{"$f":"IF('Seřazení Knt'!A44=0,\"\",'Seřazení Knt'!A44)","v":"Doubek Benjamin"},{"$f":"IF(F6=\"\",\"\",IF(AND('Seřazení Knt'!B83='Seřazení Knt'!B84,'Seřazení Knt'!C83='Seřazení Knt'!C84,'Seřazení Knt'!D83='Seřazení Knt'!D84),Žebříček!E5,Žebříček!E5+1))","v":68},{"$f":"IF('Seřazení Knt'!A84=0,\"\",'Seřazení Knt'!A84)","v":"Žmuda Maja"},{"$f":"IF(H6=\"\",\"\",IF(AND('Seřazení Knt'!B123='Seřazení Knt'!B124,'Seřazení Knt'!C123='Seřazení Knt'!C124,'Seřazení Knt'!D123='Seřazení Knt'!D124),Žebříček!G5,Žebříček!G5+1))","v":""},{"$f":"IF('Seřazení Knt'!A124=0,\"\",'Seřazení Knt'!A124)","v":""}]
[{"$f":"IF(B7=\"\",\"\",IF(AND('Seřazení Knt'!B4='Seřazení Knt'!B5,'Seřazení Knt'!C4='Seřazení Knt'!C5,'Seřazení Knt'!D4='Seřazení Knt'!D5),Žebříček!A6,Žebříček!A6+1))","v":4},{"$f":"IF('Seřazení Knt'!A5=0,\"\",'Seřazení Knt'!A5)","v":"Lysický Sebastián"},{"$f":"IF(D7=\"\",\"\",IF(AND('Seřazení Knt'!B44='Seřazení Knt'!B45,'Seřazení Knt'!C44='Seřazení Knt'!C45,'Seřazení Knt'!D44='Seřazení Knt'!D45),Žebříček!C6,Žebříček!C6+1))","v":41},{"$f":"IF('Seřazení Knt'!A45=0,\"\",'Seřazení Knt'!A45)","v":"Leone Luca"},{"$f":"IF(F7=\"\",\"\",IF(AND('Seřazení Knt'!B84='Seřazení Knt'!B85,'Seřazení Knt'!C84='Seřazení Knt'!C85,'Seřazení Knt'!D84='Seřazení Knt'!D85),Žebříček!E6,Žebříček!E6+1))","v":68},{"$f":"IF('Seřazení Knt'!A85=0,\"\",'Seřazení Knt'!A85)","v":"Tomek Vojtěch"},{"$f":"IF(H7=\"\",\"\",IF(AND('Seřazení Knt'!B124='Seřazení Knt'!B125,'Seřazení Knt'!C124='Seřazení Knt'!C125,'Seřazení Knt'!D124='Seřazení Knt'!D125),Žebříček!G6,Žebříček!G6+1))","v":""},{"$f":"IF('Seřazení Knt'!A125=0,\"\",'Seřazení Knt'!A125)","v":""}]
[{"$f":"IF(B8=\"\",\"\",IF(AND('Seřazení Knt'!B5='Seřazení Knt'!B6,'Seřazení Knt'!C5='Seřazení Knt'!C6,'Seřazení Knt'!D5='Seřazení Knt'!D6),Žebříček!A7,Žebříček!A7+1))","v":5},{"$f":"IF('Seřazení Knt'!A6=0,\"\",'Seřazení Knt'!A6)","v":"Rapčanová Alice"},{"$f":"IF(D8=\"\",\"\",IF(AND('Seřazení Knt'!B45='Seřazení Knt'!B46,'Seřazení Knt'!C45='Seřazení Knt'!C46,'Seřazení Knt'!D45='Seřazení Knt'!D46),Žebříček!C7,Žebříček!C7+1))","v":42},{"$f":"IF('Seřazení Knt'!A46=0,\"\",'Seřazení Knt'!A46)","v":"Káňová Barbora"},{"$f":"IF(F8=\"\",\"\",IF(AND('Seřazení Knt'!B85='Seřazení Knt'!B86,'Seřazení Knt'!C85='Seřazení Knt'!C86,'Seřazení Knt'!D85='Seřazení Knt'!D86),Žebříček!E7,Žebříček!E7+1))","v":68},{"$f":"IF('Seřazení Knt'!A86=0,\"\",'Seřazení Knt'!A86)","v":"Schwarz Šimon"},{"$f":"IF(H8=\"\",\"\",IF(AND('Seřazení Knt'!B125='Seřazení Knt'!B126,'Seřazení Knt'!C125='Seřazení Knt'!C126,'Seřazení Knt'!D125='Seřazení Knt'!D126),Žebříček!G7,Žebříček!G7+1))","v":""},{"$f":"IF('Seřazení Knt'!A126=0,\"\",'Seřazení Knt'!A126)","v":""}]
[{"$f":"IF(B9=\"\",\"\",IF(AND('Seřazení Knt'!B6='Seřazení Knt'!B7,'Seřazení Knt'!C6='Seřazení Knt'!C7,'Seřazení Knt'!D6='Seřazení Knt'!D7),Žebříček!A8,Žebříček!A8+1))","v":6},{"$f":"IF('Seřazení Knt'!A7=0,\"\",'Seřazení Knt'!A7)","v":"Pospíšil Jan"},{"$f":"IF(D9=\"\",\"\",IF(AND('Seřazení Knt'!B46='Seřazení Knt'!B47,'Seřazení Knt'!C46='Seřazení Knt'!C47,'Seřazení Knt'!D46='Seřazení Knt'!D47),Žebříček!C8,Žebříček!C8+1))","v":43},{"$f":"IF('Seřazení Knt'!A47=0,\"\",'Seřazení Knt'!A47)","v":"Křenek Jakub"},{"$f":"IF(F9=\"\",\"\",IF(AND('Seřazení Knt'!B86='Seřazení Knt'!B87,'Seřazení Knt'!C86='Seřazení Knt'!C87,'Seřazení Knt'!D86='Seřazení Knt'!D87),Žebříček!E8,Žebříček!E8+1))","v":68},{"$f":"IF('Seřazení Knt'!A87=0,\"\",'Seřazení Knt'!A87)","v":"Vrbas Alexandr"},{"$f":"IF(H9=\"\",\"\",IF(AND('Seřazení Knt'!B126='Seřazení Knt'!B127,'Seřazení Knt'!C126='Seřazení Knt'!C127,'Seřazení Knt'!D126='Seřazení Knt'!D127),Žebříček!G8,Žebříček!G8+1))","v":""},{"$f":"IF('Seřazení Knt'!A127=0,\"\",'Seřazení Knt'!A127)","v":""}]
[{"$f":"IF(B10=\"\",\"\",IF(AND('Seřazení Knt'!B7='Seřazení Knt'!B8,'Seřazení Knt'!C7='Seřazení Knt'!C8,'Seřazení Knt'!D7='Seřazení Knt'!D8),Žebříček!A9,Žebříček!A9+1))","v":7},{"$f":"IF('Seřazení Knt'!A8=0,\"\",'Seřazení Knt'!A8)","v":"Michálek Jakub"},{"$f":"IF(D10=\"\",\"\",IF(AND('Seřazení Knt'!B47='Seřazení Knt'!B48,'Seřazení Knt'!C47='Seřazení Knt'!C48,'Seřazení Knt'!D47='Seřazení Knt'!D48),Žebříček!C9,Žebříček!C9+1))","v":43},{"$f":"IF('Seřazení Knt'!A48=0,\"\",'Seřazení Knt'!A48)","v":"Končítek Kryštof"},{"$f":"IF(F10=\"\",\"\",IF(AND('Seřazení Knt'!B87='Seřazení Knt'!B88,'Seřazení Knt'!C87='Seřazení Knt'!C88,'Seřazení Knt'!D87='Seřazení Knt'!D88),Žebříček!E9,Žebříček!E9+1))","v":68},{"$f":"IF('Seřazení Knt'!A88=0,\"\",'Seřazení Knt'!A88)","v":"Brada Tomáš"},{"$f":"IF(H10=\"\",\"\",IF(AND('Seřazení Knt'!B127='Seřazení Knt'!B128,'Seřazení Knt'!C127='Seřazení Knt'!C128,'Seřazení Knt'!D127='Seřazení Knt'!D128),Žebříček!G9,Žebříček!G9+1))","v":""},{"$f":"IF('Seřazení Knt'!A128=0,\"\",'Seřazení Knt'!A128)","v":""}]
[{"$f":"IF(B11=\"\",\"\",IF(AND('Seřazení Knt'!B8='Seřazení Knt'!B9,'Seřazení Knt'!C8='Seřazení Knt'!C9,'Seřazení Knt'!D8='Seřazení Knt'!D9),Žebříček!A10,Žebříček!A10+1))","v":8},{"$f":"IF('Seřazení Knt'!A9=0,\"\",'Seřazení Knt'!A9)","v":"Kocmanová Lucie"},{"$f":"IF(D11=\"\",\"\",IF(AND('Seřazení Knt'!B48='Seřazení Knt'!B49,'Seřazení Knt'!C48='Seřazení Knt'!C49,'Seřazení Knt'!D48='Seřazení Knt'!D49),Žebříček!C10,Žebříček!C10+1))","v":44},{"$f":"IF('Seřazení Knt'!A49=0,\"\",'Seřazení Knt'!A49)","v":"Vavřina Viktor"},{"$f":"IF(F11=\"\",\"\",IF(AND('Seřazení Knt'!B88='Seřazení Knt'!B89,'Seřazení Knt'!C88='Seřazení Knt'!C89,'Seřazení Knt'!D88='Seřazení Knt'!D89),Žebříček!E10,Žebříček!E10+1))","v":68},{"$f":"IF('Seřazení Knt'!A89=0,\"\",'Seřazení Knt'!A89)","v":"Krischke Simon"},{"$f":"IF(H11=\"\",\"\",IF(AND('Seřazení Knt'!B128='Seřazení Knt'!B129,'Seřazení Knt'!C128='Seřazení Knt'!C129,'Seřazení Knt'!D128='Seřazení Knt'!D129),Žebříček!G10,Žebříček!G10+1))","v":""},{"$f":"IF('Seřazení Knt'!A129=0,\"\",'Seřazení Knt'!A129)","v":""}]
[{"$f":"IF(B12=\"\",\"\",IF(AND('Seřazení Knt'!B9='Seřazení Knt'!B10,'Seřazení Knt'!C9='Seřazení Knt'!C10,'Seřazení Knt'!D9='Seřazení Knt'!D10),Žebříček!A11,Žebříček!A11+1))","v":9},{"$f":"IF('Seřazení Knt'!A10=0,\"\",'Seřazení Knt'!A10)","v":"Valentík Tomáš"},{"$f":"IF(D12=\"\",\"\",IF(AND('Seřazení Knt'!B49='Seřazení Knt'!B50,'Seřazení Knt'!C49='Seřazení Knt'!C50,'Seřazení Knt'!D49='Seřazení Knt'!D50),Žebříček!C11,Žebříček!C11+1))","v":44},{"$f":"IF('Seřazení Knt'!A50=0,\"\",'Seřazení Knt'!A50)","v":"Kaszperová Kristýna"},{"$f":"IF(F12=\"\",\"\",IF(AND('Seřazení Knt'!B89='Seřazení Knt'!B90,'Seřazení Knt'!C89='Seřazení Knt'!C90,'Seřazení Knt'!D89='Seřazení Knt'!D90),Žebříček!E11,Žebříček!E11+1))","v":68},{"$f":"IF('Seřazení Knt'!A90=0,\"\",'Seřazení Knt'!A90)","v":"Urban Matěj"},{"$f":"IF(H12=\"\",\"\",IF(AND('Seřazení Knt'!B129='Seřazení Knt'!B130,'Seřazení Knt'!C129='Seřazení Knt'!C130,'Seřazení Knt'!D129='Seřazení Knt'!D130),Žebříček!G11,Žebříček!G11+1))","v":""},{"$f":"IF('Seřazení Knt'!A130=0,\"\",'Seřazení Knt'!A130)","v":""}]
[{"$f":"IF(B13=\"\",\"\",IF(AND('Seřazení Knt'!B10='Seřazení Knt'!B11,'Seřazení Knt'!C10='Seřazení Knt'!C11,'Seřazení Knt'!D10='Seřazení Knt'!D11),Žebříček!A12,Žebříček!A12+1))","v":10},{"$f":"IF('Seřazení Knt'!A11=0,\"\",'Seřazení Knt'!A11)","v":"Nováček Nikolas"},{"$f":"IF(D13=\"\",\"\",IF(AND('Seřazení Knt'!B50='Seřazení Knt'!B51,'Seřazení Knt'!C50='Seřazení Knt'!C51,'Seřazení Knt'!D50='Seřazení Knt'!D51),Žebříček!C12,Žebříček!C12+1))","v":44},{"$f":"IF('Seřazení Knt'!A51=0,\"\",'Seřazení Knt'!A51)","v":"Černý Michal"},{"$f":"IF(F13=\"\",\"\",IF(AND('Seřazení Knt'!B90='Seřazení Knt'!B91,'Seřazení Knt'!C90='Seřazení Knt'!C91,'Seřazení Knt'!D90='Seřazení Knt'!D91),Žebříček!E12,Žebříček!E12+1))","v":68},{"$f":"IF('Seřazení Knt'!A91=0,\"\",'Seřazení Knt'!A91)","v":"Beutel David"},{"$f":"IF(H13=\"\",\"\",IF(AND('Seřazení Knt'!B130='Seřazení Knt'!B131,'Seřazení Knt'!C130='Seřazení Knt'!C131,'Seřazení Knt'!D130='Seřazení Knt'!D131),Žebříček!G12,Žebříček!G12+1))","v":""},{"$f":"IF('Seřazení Knt'!A131=0,\"\",'Seřazení Knt'!A131)","v":""}]
[{"$f":"IF(B14=\"\",\"\",IF(AND('Seřazení Knt'!B11='Seřazení Knt'!B12,'Seřazení Knt'!C11='Seřazení Knt'!C12,'Seřazení Knt'!D11='Seřazení Knt'!D12),Žebříček!A13,Žebříček!A13+1))","v":11},{"$f":"IF('Seřazení Knt'!A12=0,\"\",'Seřazení Knt'!A12)","v":"Nuhlíček Michal"},{"$f":"IF(D14=\"\",\"\",IF(AND('Seřazení Knt'!B51='Seřazení Knt'!B52,'Seřazení Knt'!C51='Seřazení Knt'!C52,'Seřazení Knt'!D51='Seřazení Knt'!D52),Žebříček!C13,Žebříček!C13+1))","v":45},{"$f":"IF('Seřazení Knt'!A52=0,\"\",'Seřazení Knt'!A52)","v":"Krischke Fabian"},{"$f":"IF(F14=\"\",\"\",IF(AND('Seřazení Knt'!B91='Seřazení Knt'!B92,'Seřazení Knt'!C91='Seřazení Knt'!C92,'Seřazení Knt'!D91='Seřazení Knt'!D92),Žebříček!E13,Žebříček!E13+1))","v":68},{"$f":"IF('Seřazení Knt'!A92=0,\"\",'Seřazení Knt'!A92)","v":"Rojíček Jan"},{"$f":"IF(H14=\"\",\"\",IF(AND('Seřazení Knt'!B131='Seřazení Knt'!B132,'Seřazení Knt'!C131='Seřazení Knt'!C132,'Seřazení Knt'!D131='Seřazení Knt'!D132),Žebříček!G13,Žebříček!G13+1))","v":""},{"$f":"IF('Seřazení Knt'!A132=0,\"\",'Seřazení Knt'!A132)","v":""}]
[{"$f":"IF(B15=\"\",\"\",IF(AND('Seřazení Knt'!B12='Seřazení Knt'!B13,'Seřazení Knt'!C12='Seřazení Knt'!C13,'Seřazení Knt'!D12='Seřazení Knt'!D13),Žebříček!A14,Žebříček!A14+1))","v":12},{"$f":"IF('Seřazení Knt'!A13=0,\"\",'Seřazení Knt'!A13)","v":"Nuhlíček Jakub"},{"$f":"IF(D15=\"\",\"\",IF(AND('Seřazení Knt'!B52='Seřazení Knt'!B53,'Seřazení Knt'!C52='Seřazení Knt'!C53,'Seřazení Knt'!D52='Seřazení Knt'!D53),Žebříček!C14,Žebříček!C14+1))","v":46},{"$f":"IF('Seřazení Knt'!A53=0,\"\",'Seřazení Knt'!A53)","v":"Bencúr Eliáš"},{"$f":"IF(F15=\"\",\"\",IF(AND('Seřazení Knt'!B92='Seřazení Knt'!B93,'Seřazení Knt'!C92='Seřazení Knt'!C93,'Seřazení Knt'!D92='Seřazení Knt'!D93),Žebříček!E14,Žebříček!E14+1))","v":69},{"$f":"IF('Seřazení Knt'!A93=0,\"\",'Seřazení Knt'!A93)","v":"Grym Petr"},{"$f":"IF(H15=\"\",\"\",IF(AND('Seřazení Knt'!B132='Seřazení Knt'!B133,'Seřazení Knt'!C132='Seřazení Knt'!C133,'Seřazení Knt'!D132='Seřazení Knt'!D133),Žebříček!G14,Žebříček!G14+1))","v":""},{"$f":"IF('Seřazení Knt'!A133=0,\"\",'Seřazení Knt'!A133)","v":""}]
[{"$f":"IF(B16=\"\",\"\",IF(AND('Seřazení Knt'!B13='Seřazení Knt'!B14,'Seřazení Knt'!C13='Seřazení Knt'!C14,'Seřazení Knt'!D13='Seřazení Knt'!D14),Žebříček!A15,Žebříček!A15+1))","v":13},{"$f":"IF('Seřazení Knt'!A14=0,\"\",'Seřazení Knt'!A14)","v":"Bukovjanová Charlotte"},{"$f":"IF(D16=\"\",\"\",IF(AND('Seřazení Knt'!B53='Seřazení Knt'!B54,'Seřazení Knt'!C53='Seřazení Knt'!C54,'Seřazení Knt'!D53='Seřazení Knt'!D54),Žebříček!C15,Žebříček!C15+1))","v":47},{"$f":"IF('Seřazení Knt'!A54=0,\"\",'Seřazení Knt'!A54)","v":"Filipiak Adam"},{"$f":"IF(F16=\"\",\"\",IF(AND('Seřazení Knt'!B93='Seřazení Knt'!B94,'Seřazení Knt'!C93='Seřazení Knt'!C94,'Seřazení Knt'!D93='Seřazení Knt'!D94),Žebříček!E15,Žebříček!E15+1))","v":69},{"$f":"IF('Seřazení Knt'!A94=0,\"\",'Seřazení Knt'!A94)","v":"Mohyla David"},{"$f":"IF(H16=\"\",\"\",IF(AND('Seřazení Knt'!B133='Seřazení Knt'!B134,'Seřazení Knt'!C133='Seřazení Knt'!C134,'Seřazení Knt'!D133='Seřazení Knt'!D134),Žebříček!G15,Žebříček!G15+1))","v":""},{"$f":"IF('Seřazení Knt'!A134=0,\"\",'Seřazení Knt'!A134)","v":""}]
[{"$f":"IF(B17=\"\",\"\",IF(AND('Seřazení Knt'!B14='Seřazení Knt'!B15,'Seřazení Knt'!C14='Seřazení Knt'!C15,'Seřazení Knt'!D14='Seřazení Knt'!D15),Žebříček!A16,Žebříček!A16+1))","v":14},{"$f":"IF('Seřazení Knt'!A15=0,\"\",'Seřazení Knt'!A15)","v":"Šotola Kryštof"},{"$f":"IF(D17=\"\",\"\",IF(AND('Seřazení Knt'!B54='Seřazení Knt'!B55,'Seřazení Knt'!C54='Seřazení Knt'!C55,'Seřazení Knt'!D54='Seřazení Knt'!D55),Žebříček!C16,Žebříček!C16+1))","v":48},{"$f":"IF('Seřazení Knt'!A55=0,\"\",'Seřazení Knt'!A55)","v":"Mikenda Ondřej"},{"$f":"IF(F17=\"\",\"\",IF(AND('Seřazení Knt'!B94='Seřazení Knt'!B95,'Seřazení Knt'!C94='Seřazení Knt'!C95,'Seřazení Knt'!D94='Seřazení Knt'!D95),Žebříček!E16,Žebříček!E16+1))","v":70},{"$f":"IF('Seřazení Knt'!A95=0,\"\",'Seřazení Knt'!A95)","v":"Vrbas Alexander"},{"$f":"IF(H17=\"\",\"\",IF(AND('Seřazení Knt'!B134='Seřazení Knt'!B135,'Seřazení Knt'!C134='Seřazení Knt'!C135,'Seřazení Knt'!D134='Seřazení Knt'!D135),Žebříček!G16,Žebříček!G16+1))","v":""},{"$f":"IF('Seřazení Knt'!A135=0,\"\",'Seřazení Knt'!A135)","v":""}]
[{"$f":"IF(B18=\"\",\"\",IF(AND('Seřazení Knt'!B15='Seřazení Knt'!B16,'Seřazení Knt'!C15='Seřazení Knt'!C16,'Seřazení Knt'!D15='Seřazení Knt'!D16),Žebříček!A17,Žebříček!A17+1))","v":15},{"$f":"IF('Seřazení Knt'!A16=0,\"\",'Seřazení Knt'!A16)","v":"Boháč Adam"},{"$f":"IF(D18=\"\",\"\",IF(AND('Seřazení Knt'!B55='Seřazení Knt'!B56,'Seřazení Knt'!C55='Seřazení Knt'!C56,'Seřazení Knt'!D55='Seřazení Knt'!D56),Žebříček!C17,Žebříček!C17+1))","v":49},{"$f":"IF('Seřazení Knt'!A56=0,\"\",'Seřazení Knt'!A56)","v":"Řeha Daniel"},{"$f":"IF(F18=\"\",\"\",IF(AND('Seřazení Knt'!B95='Seřazení Knt'!B96,'Seřazení Knt'!C95='Seřazení Knt'!C96,'Seřazení Knt'!D95='Seřazení Knt'!D96),Žebříček!E17,Žebříček!E17+1))","v":71},{"$f":"IF('Seřazení Knt'!A96=0,\"\",'Seřazení Knt'!A96)","v":"Muráň Tomáš"},{"$f":"IF(H18=\"\",\"\",IF(AND('Seřazení Knt'!B135='Seřazení Knt'!B136,'Seřazení Knt'!C135='Seřazení Knt'!C136,'Seřazení Knt'!D135='Seřazení Knt'!D136),Žebříček!G17,Žebříček!G17+1))","v":""},{"$f":"IF('Seřazení Knt'!A136=0,\"\",'Seřazení Knt'!A136)","v":""}]
[{"$f":"IF(B19=\"\",\"\",IF(AND('Seřazení Knt'!B16='Seřazení Knt'!B17,'Seřazení Knt'!C16='Seřazení Knt'!C17,'Seřazení Knt'!D16='Seřazení Knt'!D17),Žebříček!A18,Žebříček!A18+1))","v":16},{"$f":"IF('Seřazení Knt'!A17=0,\"\",'Seřazení Knt'!A17)","v":"Suchan Jan"},{"$f":"IF(D19=\"\",\"\",IF(AND('Seřazení Knt'!B56='Seřazení Knt'!B57,'Seřazení Knt'!C56='Seřazení Knt'!C57,'Seřazení Knt'!D56='Seřazení Knt'!D57),Žebříček!C18,Žebříček!C18+1))","v":50},{"$f":"IF('Seřazení Knt'!A57=0,\"\",'Seřazení Knt'!A57)","v":"Dvorský Denis"},{"$f":"IF(F19=\"\",\"\",IF(AND('Seřazení Knt'!B96='Seřazení Knt'!B97,'Seřazení Knt'!C96='Seřazení Knt'!C97,'Seřazení Knt'!D96='Seřazení Knt'!D97),Žebříček!E18,Žebříček!E18+1))","v":71},{"$f":"IF('Seřazení Knt'!A97=0,\"\",'Seřazení Knt'!A97)","v":"Pindor Miroslav"},{"$f":"IF(H19=\"\",\"\",IF(AND('Seřazení Knt'!B136='Seřazení Knt'!B137,'Seřazení Knt'!C136='Seřazení Knt'!C137,'Seřazení Knt'!D136='Seřazení Knt'!D137),Žebříček!G18,Žebříček!G18+1))","v":""},{"$f":"IF('Seřazení Knt'!A137=0,\"\",'Seřazení Knt'!A137)","v":""}]
[{"$f":"IF(B20=\"\",\"\",IF(AND('Seřazení Knt'!B17='Seřazení Knt'!B18,'Seřazení Knt'!C17='Seřazení Knt'!C18,'Seřazení Knt'!D17='Seřazení Knt'!D18),Žebříček!A19,Žebříček!A19+1))","v":17},{"$f":"IF('Seřazení Knt'!A18=0,\"\",'Seřazení Knt'!A18)","v":"Stark Vojtěch"},{"$f":"IF(D20=\"\",\"\",IF(AND('Seřazení Knt'!B57='Seřazení Knt'!B58,'Seřazení Knt'!C57='Seřazení Knt'!C58,'Seřazení Knt'!D57='Seřazení Knt'!D58),Žebříček!C19,Žebříček!C19+1))","v":50},{"$f":"IF('Seřazení Knt'!A58=0,\"\",'Seřazení Knt'!A58)","v":"Vavřinová Pavla"},{"$f":"IF(F20=\"\",\"\",IF(AND('Seřazení Knt'!B97='Seřazení Knt'!B98,'Seřazení Knt'!C97='Seřazení Knt'!C98,'Seřazení Knt'!D97='Seřazení Knt'!D98),Žebříček!E19,Žebříček!E19+1))","v":72},{"$f":"IF('Seřazení Knt'!A98=0,\"\",'Seřazení Knt'!A98)","v":"Caletka Michal"},{"$f":"IF(H20=\"\",\"\",IF(AND('Seřazení Knt'!B137='Seřazení Knt'!B138,'Seřazení Knt'!C137='Seřazení Knt'!C138,'Seřazení Knt'!D137='Seřazení Knt'!D138),Žebříček!G19,Žebříček!G19+1))","v":""},{"$f":"IF('Seřazení Knt'!A138=0,\"\",'Seřazení Knt'!A138)","v":""}]
[{"$f":"IF(B21=\"\",\"\",IF(AND('Seřazení Knt'!B18='Seřazení Knt'!B19,'Seřazení Knt'!C18='Seřazení Knt'!C19,'Seřazení Knt'!D18='Seřazení Knt'!D19),Žebříček!A20,Žebříček!A20+1))","v":18},{"$f":"IF('Seřazení Knt'!A19=0,\"\",'Seřazení Knt'!A19)","v":"Čech Jiří"},{"$f":"IF(D21=\"\",\"\",IF(AND('Seřazení Knt'!B58='Seřazení Knt'!B59,'Seřazení Knt'!C58='Seřazení Knt'!C59,'Seřazení Knt'!D58='Seřazení Knt'!D59),Žebříček!C20,Žebříček!C20+1))","v":51},{"$f":"IF('Seřazení Knt'!A59=0,\"\",'Seřazení Knt'!A59)","v":"Kapias Oliver"},{"$f":"IF(F21=\"\",\"\",IF(AND('Seřazení Knt'!B98='Seřazení Knt'!B99,'Seřazení Knt'!C98='Seřazení Knt'!C99,'Seřazení Knt'!D98='Seřazení Knt'!D99),Žebříček!E20,Žebříček!E20+1))","v":73},{"$f":"IF('Seřazení Knt'!A99=0,\"\",'Seřazení Knt'!A99)","v":"Salzman Václav"},{"$f":"IF(H21=\"\",\"\",IF(AND('Seřazení Knt'!B138='Seřazení Knt'!B139,'Seřazení Knt'!C138='Seřazení Knt'!C139,'Seřazení Knt'!D138='Seřazení Knt'!D139),Žebříček!G20,Žebříček!G20+1))","v":""},{"$f":"IF('Seřazení Knt'!A139=0,\"\",'Seřazení Knt'!A139)","v":""}]
[{"$f":"IF(B22=\"\",\"\",IF(AND('Seřazení Knt'!B19='Seřazení Knt'!B20,'Seřazení Knt'!C19='Seřazení Knt'!C20,'Seřazení Knt'!D19='Seřazení Knt'!D20),Žebříček!A21,Žebříček!A21+1))","v":19},{"$f":"IF('Seřazení Knt'!A20=0,\"\",'Seřazení Knt'!A20)","v":"Ďuriš Vojtěch"},{"$f":"IF(D22=\"\",\"\",IF(AND('Seřazení Knt'!B59='Seřazení Knt'!B60,'Seřazení Knt'!C59='Seřazení Knt'!C60,'Seřazení Knt'!D59='Seřazení Knt'!D60),Žebříček!C21,Žebříček!C21+1))","v":52},{"$f":"IF('Seřazení Knt'!A60=0,\"\",'Seřazení Knt'!A60)","v":"Vjaclovský David"},{"$f":"IF(F22=\"\",\"\",IF(AND('Seřazení Knt'!B99='Seřazení Knt'!B100,'Seřazení Knt'!C99='Seřazení Knt'!C100,'Seřazení Knt'!D99='Seřazení Knt'!D100),Žebříček!E21,Žebříček!E21+1))","v":73},{"$f":"IF('Seřazení Knt'!A100=0,\"\",'Seřazení Knt'!A100)","v":"Salek Natalia"},{"$f":"IF(H22=\"\",\"\",IF(AND('Seřazení Knt'!B139='Seřazení Knt'!B140,'Seřazení Knt'!C139='Seřazení Knt'!C140,'Seřazení Knt'!D139='Seřazení Knt'!D140),Žebříček!G21,Žebříček!G21+1))","v":""},{"$f":"IF('Seřazení Knt'!A140=0,\"\",'Seřazení Knt'!A140)","v":""}]
[{"$f":"IF(B23=\"\",\"\",IF(AND('Seřazení Knt'!B20='Seřazení Knt'!B21,'Seřazení Knt'!C20='Seřazení Knt'!C21,'Seřazení Knt'!D20='Seřazení Knt'!D21),Žebříček!A22,Žebříček!A22+1))","v":20},{"$f":"IF('Seřazení Knt'!A21=0,\"\",'Seřazení Knt'!A21)","v":"Ryška Filip"},{"$f":"IF(D23=\"\",\"\",IF(AND('Seřazení Knt'!B60='Seřazení Knt'!B61,'Seřazení Knt'!C60='Seřazení Knt'!C61,'Seřazení Knt'!D60='Seřazení Knt'!D61),Žebříček!C22,Žebříček!C22+1))","v":53},{"$f":"IF('Seřazení Knt'!A61=0,\"\",'Seřazení Knt'!A61)","v":"Halagačka Jiří"},{"$f":"IF(F23=\"\",\"\",IF(AND('Seřazení Knt'!B100='Seřazení Knt'!B101,'Seřazení Knt'!C100='Seřazení Knt'!C101,'Seřazení Knt'!D100='Seřazení Knt'!D101),Žebříček!E22,Žebříček!E22+1))","v":74},{"$f":"IF('Seřazení Knt'!A101=0,\"\",'Seřazení Knt'!A101)","v":"Kožušník Vojtěch"},{"$f":"IF(H23=\"\",\"\",IF(AND('Seřazení Knt'!B140='Seřazení Knt'!B141,'Seřazení Knt'!C140='Seřazení Knt'!C141,'Seřazení Knt'!D140='Seřazení Knt'!D141),Žebříček!G22,Žebříček!G22+1))","v":""},{"$f":"IF('Seřazení Knt'!A141=0,\"\",'Seřazení Knt'!A141)","v":""}]
[{"$f":"IF(B24=\"\",\"\",IF(AND('Seřazení Knt'!B21='Seřazení Knt'!B22,'Seřazení Knt'!C21='Seřazení Knt'!C22,'Seřazení Knt'!D21='Seřazení Knt'!D22),Žebříček!A23,Žebříček!A23+1))","v":21},{"$f":"IF('Seřazení Knt'!A22=0,\"\",'Seřazení Knt'!A22)","v":"Jakšík Daniel"},{"$f":"IF(D24=\"\",\"\",IF(AND('Seřazení Knt'!B61='Seřazení Knt'!B62,'Seřazení Knt'!C61='Seřazení Knt'!C62,'Seřazení Knt'!D61='Seřazení Knt'!D62),Žebříček!C23,Žebříček!C23+1))","v":53},{"$f":"IF('Seřazení Knt'!A62=0,\"\",'Seřazení Knt'!A62)","v":"Žurek Sebastián"},{"$f":"IF(F24=\"\",\"\",IF(AND('Seřazení Knt'!B101='Seřazení Knt'!B102,'Seřazení Knt'!C101='Seřazení Knt'!C102,'Seřazení Knt'!D101='Seřazení Knt'!D102),Žebříček!E23,Žebříček!E23+1))","v":74},{"$f":"IF('Seřazení Knt'!A102=0,\"\",'Seřazení Knt'!A102)","v":"Mikendová Tereza"},{"$f":"IF(H24=\"\",\"\",IF(AND('Seřazení Knt'!B141='Seřazení Knt'!B142,'Seřazení Knt'!C141='Seřazení Knt'!C142,'Seřazení Knt'!D141='Seřazení Knt'!D142),Žebříček!G23,Žebříček!G23+1))","v":""},{"$f":"IF('Seřazení Knt'!A142=0,\"\",'Seřazení Knt'!A142)","v":""}]
[{"$f":"IF(B25=\"\",\"\",IF(AND('Seřazení Knt'!B22='Seřazení Knt'!B23,'Seřazení Knt'!C22='Seřazení Knt'!C23,'Seřazení Knt'!D22='Seřazení Knt'!D23),Žebříček!A24,Žebříček!A24+1))","v":22},{"$f":"IF('Seřazení Knt'!A23=0,\"\",'Seřazení Knt'!A23)","v":"Turek Jakub"},{"$f":"IF(D25=\"\",\"\",IF(AND('Seřazení Knt'!B62='Seřazení Knt'!B63,'Seřazení Knt'!C62='Seřazení Knt'!C63,'Seřazení Knt'!D62='Seřazení Knt'!D63),Žebříček!C24,Žebříček!C24+1))","v":54},{"$f":"IF('Seřazení Knt'!A63=0,\"\",'Seřazení Knt'!A63)","v":"Hisem Matěj"},{"$f":"IF(F25=\"\",\"\",IF(AND('Seřazení Knt'!B102='Seřazení Knt'!B103,'Seřazení Knt'!C102='Seřazení Knt'!C103,'Seřazení Knt'!D102='Seřazení Knt'!D103),Žebříček!E24,Žebříček!E24+1))","v":74},{"$f":"IF('Seřazení Knt'!A103=0,\"\",'Seřazení Knt'!A103)","v":"Hegner Leoš"},{"$f":"IF(H25=\"\",\"\",IF(AND('Seřazení Knt'!B142='Seřazení Knt'!B143,'Seřazení Knt'!C142='Seřazení Knt'!C143,'Seřazení Knt'!D142='Seřazení Knt'!D143),Žebříček!G24,Žebříček!G24+1))","v":""},{"$f":"IF('Seřazení Knt'!A143=0,\"\",'Seřazení Knt'!A143)","v":""}]
[{"$f":"IF(B26=\"\",\"\",IF(AND('Seřazení Knt'!B23='Seřazení Knt'!B24,'Seřazení Knt'!C23='Seřazení Knt'!C24,'Seřazení Knt'!D23='Seřazení Knt'!D24),Žebříček!A25,Žebříček!A25+1))","v":23},{"$f":"IF('Seřazení Knt'!A24=0,\"\",'Seřazení Knt'!A24)","v":"Benáčková Denisa"},{"$f":"IF(D26=\"\",\"\",IF(AND('Seřazení Knt'!B63='Seřazení Knt'!B64,'Seřazení Knt'!C63='Seřazení Knt'!C64,'Seřazení Knt'!D63='Seřazení Knt'!D64),Žebříček!C25,Žebříček!C25+1))","v":54},{"$f":"IF('Seřazení Knt'!A64=0,\"\",'Seřazení Knt'!A64)","v":"Kolářová Valentýna"},{"$f":"IF(F26=\"\",\"\",IF(AND('Seřazení Knt'!B103='Seřazení Knt'!B104,'Seřazení Knt'!C103='Seřazení Knt'!C104,'Seřazení Knt'!D103='Seřazení Knt'!D104),Žebříček!E25,Žebříček!E25+1))","v":74},{"$f":"IF('Seřazení Knt'!A104=0,\"\",'Seřazení Knt'!A104)","v":"Strachota Vojtěch"},{"$f":"IF(H26=\"\",\"\",IF(AND('Seřazení Knt'!B143='Seřazení Knt'!B144,'Seřazení Knt'!C143='Seřazení Knt'!C144,'Seřazení Knt'!D143='Seřazení Knt'!D144),Žebříček!G25,Žebříček!G25+1))","v":""},{"$f":"IF('Seřazení Knt'!A144=0,\"\",'Seřazení Knt'!A144)","v":""}]
[{"$f":"IF(B27=\"\",\"\",IF(AND('Seřazení Knt'!B24='Seřazení Knt'!B25,'Seřazení Knt'!C24='Seřazení Knt'!C25,'Seřazení Knt'!D24='Seřazení Knt'!D25),Žebříček!A26,Žebříček!A26+1))","v":24},{"$f":"IF('Seřazení Knt'!A25=0,\"\",'Seřazení Knt'!A25)","v":"Rapčanová Silvie"},{"$f":"IF(D27=\"\",\"\",IF(AND('Seřazení Knt'!B64='Seřazení Knt'!B65,'Seřazení Knt'!C64='Seřazení Knt'!C65,'Seřazení Knt'!D64='Seřazení Knt'!D65),Žebříček!C26,Žebříček!C26+1))","v":54},{"$f":"IF('Seřazení Knt'!A65=0,\"\",'Seřazení Knt'!A65)","v":"Kolář Vojtěch"},{"$f":"IF(F27=\"\",\"\",IF(AND('Seřazení Knt'!B104='Seřazení Knt'!B105,'Seřazení Knt'!C104='Seřazení Knt'!C105,'Seřazení Knt'!D104='Seřazení Knt'!D105),Žebříček!E26,Žebříček!E26+1))","v":74},{"$f":"IF('Seřazení Knt'!A105=0,\"\",'Seřazení Knt'!A105)","v":"Přikryl Tomáš"},{"$f":"IF(H27=\"\",\"\",IF(AND('Seřazení Knt'!B144='Seřazení Knt'!B145,'Seřazení Knt'!C144='Seřazení Knt'!C145,'Seřazení Knt'!D144='Seřazení Knt'!D145),Žebříček!G26,Žebříček!G26+1))","v":""},{"$f":"IF('Seřazení Knt'!A145=0,\"\",'Seřazení Knt'!A145)","v":""}]
[{"$f":"IF(B28=\"\",\"\",IF(AND('Seřazení Knt'!B25='Seřazení Knt'!B26,'Seřazení Knt'!C25='Seřazení Knt'!C26,'Seřazení Knt'!D25='Seřazení Knt'!D26),Žebříček!A27,Žebříček!A27+1))","v":24},{"$f":"IF('Seřazení Knt'!A26=0,\"\",'Seřazení Knt'!A26)","v":"Novotný Kryštof"},{"$f":"IF(D28=\"\",\"\",IF(AND('Seřazení Knt'!B65='Seřazení Knt'!B66,'Seřazení Knt'!C65='Seřazení Knt'!C66,'Seřazení Knt'!D65='Seřazení Knt'!D66),Žebříček!C27,Žebříček!C27+1))","v":55},{"$f":"IF('Seřazení Knt'!A66=0,\"\",'Seřazení Knt'!A66)","v":"Kulhánek Adam"},{"$f":"IF(F28=\"\",\"\",IF(AND('Seřazení Knt'!B105='Seřazení Knt'!B106,'Seřazení Knt'!C105='Seřazení Knt'!C106,'Seřazení Knt'!D105='Seřazení Knt'!D106),Žebříček!E27,Žebříček!E27+1))","v":74},{"$f":"IF('Seřazení Knt'!A106=0,\"\",'Seřazení Knt'!A106)","v":"Kristýna Kazsperová"},{"$f":"IF(H28=\"\",\"\",IF(AND('Seřazení Knt'!B145='Seřazení Knt'!B146,'Seřazení Knt'!C145='Seřazení Knt'!C146,'Seřazení Knt'!D145='Seřazení Knt'!D146),Žebříček!G27,Žebříček!G27+1))","v":""},{"$f":"IF('Seřazení Knt'!A146=0,\"\",'Seřazení Knt'!A146)","v":""}]
[{"$f":"IF(B29=\"\",\"\",IF(AND('Seřazení Knt'!B26='Seřazení Knt'!B27,'Seřazení Knt'!C26='Seřazení Knt'!C27,'Seřazení Knt'!D26='Seřazení Knt'!D27),Žebříček!A28,Žebříček!A28+1))","v":25},{"$f":"IF('Seřazení Knt'!A27=0,\"\",'Seřazení Knt'!A27)","v":"Mec Tobias"},{"$f":"IF(D29=\"\",\"\",IF(AND('Seřazení Knt'!B66='Seřazení Knt'!B67,'Seřazení Knt'!C66='Seřazení Knt'!C67,'Seřazení Knt'!D66='Seřazení Knt'!D67),Žebříček!C28,Žebříček!C28+1))","v":56},{"$f":"IF('Seřazení Knt'!A67=0,\"\",'Seřazení Knt'!A67)","v":"King Samuel"},{"$f":"IF(F29=\"\",\"\",IF(AND('Seřazení Knt'!B106='Seřazení Knt'!B107,'Seřazení Knt'!C106='Seřazení Knt'!C107,'Seřazení Knt'!D106='Seřazení Knt'!D107),Žebříček!E28,Žebříček!E28+1))","v":75},{"$f":"IF('Seřazení Knt'!A107=0,\"\",'Seřazení Knt'!A107)","v":"Šebesta Jakub"},{"$f":"IF(H29=\"\",\"\",IF(AND('Seřazení Knt'!B146='Seřazení Knt'!B147,'Seřazení Knt'!C146='Seřazení Knt'!C147,'Seřazení Knt'!D146='Seřazení Knt'!D147),Žebříček!G28,Žebříček!G28+1))","v":""},{"$f":"IF('Seřazení Knt'!A147=0,\"\",'Seřazení Knt'!A147)","v":""}]
[{"$f":"IF(B30=\"\",\"\",IF(AND('Seřazení Knt'!B27='Seřazení Knt'!B28,'Seřazení Knt'!C27='Seřazení Knt'!C28,'Seřazení Knt'!D27='Seřazení Knt'!D28),Žebříček!A29,Žebříček!A29+1))","v":26},{"$f":"IF('Seřazení Knt'!A28=0,\"\",'Seřazení Knt'!A28)","v":"Huvar Matyáš"},{"$f":"IF(D30=\"\",\"\",IF(AND('Seřazení Knt'!B67='Seřazení Knt'!B68,'Seřazení Knt'!C67='Seřazení Knt'!C68,'Seřazení Knt'!D67='Seřazení Knt'!D68),Žebříček!C29,Žebříček!C29+1))","v":57},{"$f":"IF('Seřazení Knt'!A68=0,\"\",'Seřazení Knt'!A68)","v":"Matějíčka Štěpán"},{"$f":"IF(F30=\"\",\"\",IF(AND('Seřazení Knt'!B107='Seřazení Knt'!B108,'Seřazení Knt'!C107='Seřazení Knt'!C108,'Seřazení Knt'!D107='Seřazení Knt'!D108),Žebříček!E29,Žebříček!E29+1))","v":76},{"$f":"IF('Seřazení Knt'!A108=0,\"\",'Seřazení Knt'!A108)","v":"Vlaškovský Lukáš"},{"$f":"IF(H30=\"\",\"\",IF(AND('Seřazení Knt'!B147='Seřazení Knt'!B148,'Seřazení Knt'!C147='Seřazení Knt'!C148,'Seřazení Knt'!D147='Seřazení Knt'!D148),Žebříček!G29,Žebříček!G29+1))","v":""},{"$f":"IF('Seřazení Knt'!A148=0,\"\",'Seřazení Knt'!A148)","v":""}]
[{"$f":"IF(B31=\"\",\"\",IF(AND('Seřazení Knt'!B28='Seřazení Knt'!B29,'Seřazení Knt'!C28='Seřazení Knt'!C29,'Seřazení Knt'!D28='Seřazení Knt'!D29),Žebříček!A30,Žebříček!A30+1))","v":27},{"$f":"IF('Seřazení Knt'!A29=0,\"\",'Seřazení Knt'!A29)","v":"Kožušník Václav"},{"$f":"IF(D31=\"\",\"\",IF(AND('Seřazení Knt'!B68='Seřazení Knt'!B69,'Seřazení Knt'!C68='Seřazení Knt'!C69,'Seřazení Knt'!D68='Seřazení Knt'!D69),Žebříček!C30,Žebříček!C30+1))","v":58},{"$f":"IF('Seřazení Knt'!A69=0,\"\",'Seřazení Knt'!A69)","v":"Sněhota Matyáš"},{"$f":"IF(F31=\"\",\"\",IF(AND('Seřazení Knt'!B108='Seřazení Knt'!B109,'Seřazení Knt'!C108='Seřazení Knt'!C109,'Seřazení Knt'!D108='Seřazení Knt'!D109),Žebříček!E30,Žebříček!E30+1))","v":77},{"$f":"IF('Seřazení Knt'!A109=0,\"\",'Seřazení Knt'!A109)","v":"Kolář Václav"},{"$f":"IF(H31=\"\",\"\",IF(AND('Seřazení Knt'!B148='Seřazení Knt'!B149,'Seřazení Knt'!C148='Seřazení Knt'!C149,'Seřazení Knt'!D148='Seřazení Knt'!D149),Žebříček!G30,Žebříček!G30+1))","v":""},{"$f":"IF('Seřazení Knt'!A149=0,\"\",'Seřazení Knt'!A149)","v":""}]
[{"$f":"IF(B32=\"\",\"\",IF(AND('Seřazení Knt'!B29='Seřazení Knt'!B30,'Seřazení Knt'!C29='Seřazení Knt'!C30,'Seřazení Knt'!D29='Seřazení Knt'!D30),Žebříček!A31,Žebříček!A31+1))","v":27},{"$f":"IF('Seřazení Knt'!A30=0,\"\",'Seřazení Knt'!A30)","v":"Caletka Petr"},{"$f":"IF(D32=\"\",\"\",IF(AND('Seřazení Knt'!B69='Seřazení Knt'!B70,'Seřazení Knt'!C69='Seřazení Knt'!C70,'Seřazení Knt'!D69='Seřazení Knt'!D70),Žebříček!C31,Žebříček!C31+1))","v":59},{"$f":"IF('Seřazení Knt'!A70=0,\"\",'Seřazení Knt'!A70)","v":"Wilkus Richard"},{"$f":"IF(F32=\"\",\"\",IF(AND('Seřazení Knt'!B109='Seřazení Knt'!B110,'Seřazení Knt'!C109='Seřazení Knt'!C110,'Seřazení Knt'!D109='Seřazení Knt'!D110),Žebříček!E31,Žebříček!E31+1))","v":77},{"$f":"IF('Seřazení Knt'!A110=0,\"\",'Seřazení Knt'!A110)","v":"Válek Matěj"},{"$f":"IF(H32=\"\",\"\",IF(AND('Seřazení Knt'!B149='Seřazení Knt'!B150,'Seřazení Knt'!C149='Seřazení Knt'!C150,'Seřazení Knt'!D149='Seřazení Knt'!D150),Žebříček!G31,Žebříček!G31+1))","v":""},{"$f":"IF('Seřazení Knt'!A150=0,\"\",'Seřazení Knt'!A150)","v":""}]
[{"$f":"IF(B33=\"\",\"\",IF(AND('Seřazení Knt'!B30='Seřazení Knt'!B31,'Seřazení Knt'!C30='Seřazení Knt'!C31,'Seřazení Knt'!D30='Seřazení Knt'!D31),Žebříček!A32,Žebříček!A32+1))","v":28},{"$f":"IF('Seřazení Knt'!A31=0,\"\",'Seřazení Knt'!A31)","v":"Mička Tomáš"},{"$f":"IF(D33=\"\",\"\",IF(AND('Seřazení Knt'!B70='Seřazení Knt'!B71,'Seřazení Knt'!C70='Seřazení Knt'!C71,'Seřazení Knt'!D70='Seřazení Knt'!D71),Žebříček!C32,Žebříček!C32+1))","v":60},{"$f":"IF('Seřazení Knt'!A71=0,\"\",'Seřazení Knt'!A71)","v":"Siekiera Jakub"},{"$f":"IF(F33=\"\",\"\",IF(AND('Seřazení Knt'!B110='Seřazení Knt'!B111,'Seřazení Knt'!C110='Seřazení Knt'!C111,'Seřazení Knt'!D110='Seřazení Knt'!D111),Žebříček!E32,Žebříček!E32+1))","v":77},{"$f":"IF('Seřazení Knt'!A111=0,\"\",'Seřazení Knt'!A111)","v":"Matušek Jakub"},{"$f":"IF(H33=\"\",\"\",IF(AND('Seřazení Knt'!B150='Seřazení Knt'!B151,'Seřazení Knt'!C150='Seřazení Knt'!C151,'Seřazení Knt'!D150='Seřazení Knt'!D151),Žebříček!G32,Žebříček!G32+1))","v":""},{"$f":"IF('Seřazení Knt'!A151=0,\"\",'Seřazení Knt'!A151)","v":""}]
[{"$f":"IF(B34=\"\",\"\",IF(AND('Seřazení Knt'!B31='Seřazení Knt'!B32,'Seřazení Knt'!C31='Seřazení Knt'!C32,'Seřazení Knt'!D31='Seřazení Knt'!D32),Žebříček!A33,Žebříček!A33+1))","v":29},{"$f":"IF('Seřazení Knt'!A32=0,\"\",'Seřazení Knt'!A32)","v":"Brož Ondřej"},{"$f":"IF(D34=\"\",\"\",IF(AND('Seřazení Knt'!B71='Seřazení Knt'!B72,'Seřazení Knt'!C71='Seřazení Knt'!C72,'Seřazení Knt'!D71='Seřazení Knt'!D72),Žebříček!C33,Žebříček!C33+1))","v":60},{"$f":"IF('Seřazení Knt'!A72=0,\"\",'Seřazení Knt'!A72)","v":"Líbenek Štěpán"},{"$f":"IF(F34=\"\",\"\",IF(AND('Seřazení Knt'!B111='Seřazení Knt'!B112,'Seřazení Knt'!C111='Seřazení Knt'!C112,'Seřazení Knt'!D111='Seřazení Knt'!D112),Žebříček!E33,Žebříček!E33+1))","v":78},{"$f":"IF('Seřazení Knt'!A112=0,\"\",'Seřazení Knt'!A112)","v":"Holaň Erik"},{"$f":"IF(H34=\"\",\"\",IF(AND('Seřazení Knt'!B151='Seřazení Knt'!B152,'Seřazení Knt'!C151='Seřazení Knt'!C152,'Seřazení Knt'!D151='Seřazení Knt'!D152),Žebříček!G33,Žebříček!G33+1))","v":""},{"$f":"IF('Seřazení Knt'!A152=0,\"\",'Seřazení Knt'!A152)","v":""}]
[{"$f":"IF(B35=\"\",\"\",IF(AND('Seřazení Knt'!B32='Seřazení Knt'!B33,'Seřazení Knt'!C32='Seřazení Knt'!C33,'Seřazení Knt'!D32='Seřazení Knt'!D33),Žebříček!A34,Žebříček!A34+1))","v":30},{"$f":"IF('Seřazení Knt'!A33=0,\"\",'Seřazení Knt'!A33)","v":"Graňák Dominik"},{"$f":"IF(D35=\"\",\"\",IF(AND('Seřazení Knt'!B72='Seřazení Knt'!B73,'Seřazení Knt'!C72='Seřazení Knt'!C73,'Seřazení Knt'!D72='Seřazení Knt'!D73),Žebříček!C34,Žebříček!C34+1))","v":60},{"$f":"IF('Seřazení Knt'!A73=0,\"\",'Seřazení Knt'!A73)","v":"Sedláček Jakub"},{"$f":"IF(F35=\"\",\"\",IF(AND('Seřazení Knt'!B112='Seřazení Knt'!B113,'Seřazení Knt'!C112='Seřazení Knt'!C113,'Seřazení Knt'!D112='Seřazení Knt'!D113),Žebříček!E34,Žebříček!E34+1))","v":79},{"$f":"IF('Seřazení Knt'!A113=0,\"\",'Seřazení Knt'!A113)","v":"Weiser Mikuláš"},{"$f":"IF(H35=\"\",\"\",IF(AND('Seřazení Knt'!B152='Seřazení Knt'!B153,'Seřazení Knt'!C152='Seřazení Knt'!C153,'Seřazení Knt'!D152='Seřazení Knt'!D153),Žebříček!G34,Žebříček!G34+1))","v":""},{"$f":"IF('Seřazení Knt'!A153=0,\"\",'Seřazení Knt'!A153)","v":""}]
[{"$f":"IF(B36=\"\",\"\",IF(AND('Seřazení Knt'!B33='Seřazení Knt'!B34,'Seřazení Knt'!C33='Seřazení Knt'!C34,'Seřazení Knt'!D33='Seřazení Knt'!D34),Žebříček!A35,Žebříček!A35+1))","v":31},{"$f":"IF('Seřazení Knt'!A34=0,\"\",'Seřazení Knt'!A34)","v":"Rapčanová Sylvie"},{"$f":"IF(D36=\"\",\"\",IF(AND('Seřazení Knt'!B73='Seřazení Knt'!B74,'Seřazení Knt'!C73='Seřazení Knt'!C74,'Seřazení Knt'!D73='Seřazení Knt'!D74),Žebříček!C35,Žebříček!C35+1))","v":60},{"$f":"IF('Seřazení Knt'!A74=0,\"\",'Seřazení Knt'!A74)","v":"Kopijas Oliver"},{"$f":"IF(F36=\"\",\"\",IF(AND('Seřazení Knt'!B113='Seřazení Knt'!B114,'Seřazení Knt'!C113='Seřazení Knt'!C114,'Seřazení Knt'!D113='Seřazení Knt'!D114),Žebříček!E35,Žebříček!E35+1))","v":80},{"$f":"IF('Seřazení Knt'!A114=0,\"\",'Seřazení Knt'!A114)","v":"Hladík Václav"},{"$f":"IF(H36=\"\",\"\",IF(AND('Seřazení Knt'!B153='Seřazení Knt'!B154,'Seřazení Knt'!C153='Seřazení Knt'!C154,'Seřazení Knt'!D153='Seřazení Knt'!D154),Žebříček!G35,Žebříček!G35+1))","v":""},{"$f":"IF('Seřazení Knt'!A154=0,\"\",'Seřazení Knt'!A154)","v":""}]
[{"$f":"IF(B37=\"\",\"\",IF(AND('Seřazení Knt'!B34='Seřazení Knt'!B35,'Seřazení Knt'!C34='Seřazení Knt'!C35,'Seřazení Knt'!D34='Seřazení Knt'!D35),Žebříček!A36,Žebříček!A36+1))","v":32},{"$f":"IF('Seřazení Knt'!A35=0,\"\",'Seřazení Knt'!A35)","v":"Marný Jakub"},{"$f":"IF(D37=\"\",\"\",IF(AND('Seřazení Knt'!B74='Seřazení Knt'!B75,'Seřazení Knt'!C74='Seřazení Knt'!C75,'Seřazení Knt'!D74='Seřazení Knt'!D75),Žebříček!C36,Žebříček!C36+1))","v":60},{"$f":"IF('Seřazení Knt'!A75=0,\"\",'Seřazení Knt'!A75)","v":"Choleva Martin"},{"$f":"IF(F37=\"\",\"\",IF(AND('Seřazení Knt'!B114='Seřazení Knt'!B115,'Seřazení Knt'!C114='Seřazení Knt'!C115,'Seřazení Knt'!D114='Seřazení Knt'!D115),Žebříček!E36,Žebříček!E36+1))","v":81},{"$f":"IF('Seřazení Knt'!A115=0,\"\",'Seřazení Knt'!A115)","v":"Kolář  Václav"},{"$f":"IF(H37=\"\",\"\",IF(AND('Seřazení Knt'!B154='Seřazení Knt'!B155,'Seřazení Knt'!C154='Seřazení Knt'!C155,'Seřazení Knt'!D154='Seřazení Knt'!D155),Žebříček!G36,Žebříček!G36+1))","v":""},{"$f":"IF('Seřazení Knt'!A155=0,\"\",'Seřazení Knt'!A155)","v":""}]
[{"$f":"IF(B38=\"\",\"\",IF(AND('Seřazení Knt'!B35='Seřazení Knt'!B36,'Seřazení Knt'!C35='Seřazení Knt'!C36,'Seřazení Knt'!D35='Seřazení Knt'!D36),Žebříček!A37,Žebříček!A37+1))","v":33},{"$f":"IF('Seřazení Knt'!A36=0,\"\",'Seřazení Knt'!A36)","v":"Schotli Josef"},{"$f":"IF(D38=\"\",\"\",IF(AND('Seřazení Knt'!B75='Seřazení Knt'!B76,'Seřazení Knt'!C75='Seřazení Knt'!C76,'Seřazení Knt'!D75='Seřazení Knt'!D76),Žebříček!C37,Žebříček!C37+1))","v":61},{"$f":"IF('Seřazení Knt'!A76=0,\"\",'Seřazení Knt'!A76)","v":"Wi Alex"},{"$f":"IF(F38=\"\",\"\",IF(AND('Seřazení Knt'!B115='Seřazení Knt'!B116,'Seřazení Knt'!C115='Seřazení Knt'!C116,'Seřazení Knt'!D115='Seřazení Knt'!D116),Žebříček!E37,Žebříček!E37+1))","v":81},{"$f":"IF('Seřazení Knt'!A116=0,\"\",'Seřazení Knt'!A116)","v":"Lukas Daniel"},{"$f":"IF(H38=\"\",\"\",IF(AND('Seřazení Knt'!B155='Seřazení Knt'!B156,'Seřazení Knt'!C155='Seřazení Knt'!C156,'Seřazení Knt'!D155='Seřazení Knt'!D156),Žebříček!G37,Žebříček!G37+1))","v":""},{"$f":"IF('Seřazení Knt'!A156=0,\"\",'Seřazení Knt'!A156)","v":""}]
[{"$f":"IF(B39=\"\",\"\",IF(AND('Seřazení Knt'!B36='Seřazení Knt'!B37,'Seřazení Knt'!C36='Seřazení Knt'!C37,'Seřazení Knt'!D36='Seřazení Knt'!D37),Žebříček!A38,Žebříček!A38+1))","v":34},{"$f":"IF('Seřazení Knt'!A37=0,\"\",'Seřazení Knt'!A37)","v":"Neuwirt Petr"},{"$f":"IF(D39=\"\",\"\",IF(AND('Seřazení Knt'!B76='Seřazení Knt'!B77,'Seřazení Knt'!C76='Seřazení Knt'!C77,'Seřazení Knt'!D76='Seřazení Knt'!D77),Žebříček!C38,Žebříček!C38+1))","v":62},{"$f":"IF('Seřazení Knt'!A77=0,\"\",'Seřazení Knt'!A77)","v":"Románek Jakub"},{"$f":"IF(F39=\"\",\"\",IF(AND('Seřazení Knt'!B116='Seřazení Knt'!B117,'Seřazení Knt'!C116='Seřazení Knt'!C117,'Seřazení Knt'!D116='Seřazení Knt'!D117),Žebříček!E38,Žebříček!E38+1))","v":81},{"$f":"IF('Seřazení Knt'!A117=0,\"\",'Seřazení Knt'!A117)","v":"Skácel Antonín"},{"$f":"IF(H39=\"\",\"\",IF(AND('Seřazení Knt'!B156='Seřazení Knt'!B157,'Seřazení Knt'!C156='Seřazení Knt'!C157,'Seřazení Knt'!D156='Seřazení Knt'!D157),Žebříček!G38,Žebříček!G38+1))","v":""},{"$f":"IF('Seřazení Knt'!A157=0,\"\",'Seřazení Knt'!A157)","v":""}]
[{"$f":"IF(B40=\"\",\"\",IF(AND('Seřazení Knt'!B37='Seřazení Knt'!B38,'Seřazení Knt'!C37='Seřazení Knt'!C38,'Seřazení Knt'!D37='Seřazení Knt'!D38),Žebříček!A39,Žebříček!A39+1))","v":35},{"$f":"IF('Seřazení Knt'!A38=0,\"\",'Seřazení Knt'!A38)","v":"Salamonová Karolína"},{"$f":"IF(D40=\"\",\"\",IF(AND('Seřazení Knt'!B77='Seřazení Knt'!B78,'Seřazení Knt'!C77='Seřazení Knt'!C78,'Seřazení Knt'!D77='Seřazení Knt'!D78),Žebříček!C39,Žebříček!C39+1))","v":63},{"$f":"IF('Seřazení Knt'!A78=0,\"\",'Seřazení Knt'!A78)","v":"Černá Veronika"},{"$f":"IF(F40=\"\",\"\",IF(AND('Seřazení Knt'!B117='Seřazení Knt'!B118,'Seřazení Knt'!C117='Seřazení Knt'!C118,'Seřazení Knt'!D117='Seřazení Knt'!D118),Žebříček!E39,Žebříček!E39+1))","v":82},{"$f":"IF('Seřazení Knt'!A118=0,\"\",'Seřazení Knt'!A118)","v":"Sedláček Vojtěch"},{"$f":"IF(H40=\"\",\"\",IF(AND('Seřazení Knt'!B157='Seřazení Knt'!B158,'Seřazení Knt'!C157='Seřazení Knt'!C158,'Seřazení Knt'!D157='Seřazení Knt'!D158),Žebříček!G39,Žebříček!G39+1))","v":""},{"$f":"IF('Seřazení Knt'!A158=0,\"\",'Seřazení Knt'!A158)","v":""}]
[{"$f":"IF(B41=\"\",\"\",IF(AND('Seřazení Knt'!B38='Seřazení Knt'!B39,'Seřazení Knt'!C38='Seřazení Knt'!C39,'Seřazení Knt'!D38='Seřazení Knt'!D39),Žebříček!A40,Žebříček!A40+1))","v":35},{"$f":"IF('Seřazení Knt'!A39=0,\"\",'Seřazení Knt'!A39)","v":"Nováček Nicolas"},{"$f":"IF(D41=\"\",\"\",IF(AND('Seřazení Knt'!B78='Seřazení Knt'!B79,'Seřazení Knt'!C78='Seřazení Knt'!C79,'Seřazení Knt'!D78='Seřazení Knt'!D79),Žebříček!C40,Žebříček!C40+1))","v":64},{"$f":"IF('Seřazení Knt'!A79=0,\"\",'Seřazení Knt'!A79)","v":"Wojtas Ines"},{"$f":"IF(F41=\"\",\"\",IF(AND('Seřazení Knt'!B118='Seřazení Knt'!B119,'Seřazení Knt'!C118='Seřazení Knt'!C119,'Seřazení Knt'!D118='Seřazení Knt'!D119),Žebříček!E40,Žebříček!E40+1))","v":83},{"$f":"IF('Seřazení Knt'!A119=0,\"\",'Seřazení Knt'!A119)","v":"Ciora Jakub"},{"$f":"IF(H41=\"\",\"\",IF(AND('Seřazení Knt'!B158='Seřazení Knt'!B159,'Seřazení Knt'!C158='Seřazení Knt'!C159,'Seřazení Knt'!D158='Seřazení Knt'!D159),Žebříček!G40,Žebříček!G40+1))","v":""},{"$f":"IF('Seřazení Knt'!A159=0,\"\",'Seřazení Knt'!A159)","v":""}]
[{"$f":"IF(B42=\"\",\"\",IF(AND('Seřazení Knt'!B39='Seřazení Knt'!B40,'Seřazení Knt'!C39='Seřazení Knt'!C40,'Seřazení Knt'!D39='Seřazení Knt'!D40),Žebříček!A41,Žebříček!A41+1))","v":36},{"$f":"IF('Seřazení Knt'!A40=0,\"\",'Seřazení Knt'!A40)","v":"Papavasilevský Marek"},{"$f":"IF(D42=\"\",\"\",IF(AND('Seřazení Knt'!B79='Seřazení Knt'!B80,'Seřazení Knt'!C79='Seřazení Knt'!C80,'Seřazení Knt'!D79='Seřazení Knt'!D80),Žebříček!C41,Žebříček!C41+1))","v":65},{"$f":"IF('Seřazení Knt'!A80=0,\"\",'Seřazení Knt'!A80)","v":"Havelka Josef"},{"$f":"IF(F42=\"\",\"\",IF(AND('Seřazení Knt'!B119='Seřazení Knt'!B120,'Seřazení Knt'!C119='Seřazení Knt'!C120,'Seřazení Knt'!D119='Seřazení Knt'!D120),Žebříček!E41,Žebříček!E41+1))","v":84},{"$f":"IF('Seřazení Knt'!A120=0,\"\",'Seřazení Knt'!A120)","v":"Kopcová Eliška"},{"$f":"IF(H42=\"\",\"\",IF(AND('Seřazení Knt'!B159='Seřazení Knt'!B160,'Seřazení Knt'!C159='Seřazení Knt'!C160,'Seřazení Knt'!D159='Seřazení Knt'!D160),Žebříček!G41,Žebříček!G41+1))","v":""},{"$f":"IF('Seřazení Knt'!A160=0,\"\",'Seřazení Knt'!A160)","v":""}]
[{"$f":"IF(B43=\"\",\"\",IF(AND('Seřazení Knt'!B40='Seřazení Knt'!B41,'Seřazení Knt'!C40='Seřazení Knt'!C41,'Seřazení Knt'!D40='Seřazení Knt'!D41),Žebříček!A42,Žebříček!A42+1))","v":37},{"$f":"IF('Seřazení Knt'!A41=0,\"\",'Seřazení Knt'!A41)","v":"Marvan Lukáš"},{"$f":"IF(D43=\"\",\"\",IF(AND('Seřazení Knt'!B80='Seřazení Knt'!B81,'Seřazení Knt'!C80='Seřazení Knt'!C81,'Seřazení Knt'!D80='Seřazení Knt'!D81),Žebříček!C42,Žebříček!C42+1))","v":66},{"$f":"IF('Seřazení Knt'!A81=0,\"\",'Seřazení Knt'!A81)","v":"Kristen Vilém"},{"$f":"IF(F43=\"\",\"\",IF(AND('Seřazení Knt'!B120='Seřazení Knt'!B121,'Seřazení Knt'!C120='Seřazení Knt'!C121,'Seřazení Knt'!D120='Seřazení Knt'!D121),Žebříček!E42,Žebříček!E42+1))","v":85},{"$f":"IF('Seřazení Knt'!A121=0,\"\",'Seřazení Knt'!A121)","v":"Buček Dan"},{"$f":"IF(H43=\"\",\"\",IF(AND('Seřazení Knt'!B160='Seřazení Knt'!B161,'Seřazení Knt'!C160='Seřazení Knt'!C161,'Seřazení Knt'!D160='Seřazení Knt'!D161),Žebříček!G42,Žebříček!G42+1))","v":""},{"$f":"IF('Seřazení Knt'!A161=0,\"\",'Seřazení Knt'!A161)","v":""}]